hadoop-mapreduce-dev mailing list archives

Site index · List index
Message view « Date » · « Thread »
Top « Date » · « Thread »
From Apache Jenkins Server <jenk...@builds.apache.org>
Subject Hadoop-Mapreduce-trunk - Build # 1564 - Still Failing
Date Mon, 30 Sep 2013 14:18:15 GMT
See https://builds.apache.org/job/Hadoop-Mapreduce-trunk/1564/

###################################################################################
########################## LAST 60 LINES OF THE CONSOLE ###########################
[...truncated 34271 lines...]
Tests in error: 
  TestMiniMRClasspath.testClassPath:175 » YarnRuntime java.lang.OutOfMemoryError...
  TestMiniMRClasspath.testExternalWritable:207 » YarnRuntime java.lang.OutOfMemo...
  TestMiniMRWithDFSWithDistinctUsers.setUp:97 » YarnRuntime java.lang.OutOfMemor...
  TestMiniMRWithDFSWithDistinctUsers.setUp:97 » YarnRuntime java.lang.OutOfMemor...
  TestClusterMRNotification>NotificationTestCase.testMR:156->NotificationTestCase.launchWordCount:241
» IO
  TestReduceFetchFromPartialMem$1>TestSetup.run:27->setUp:61 » YarnRuntime java....
  TestBlockLimits.testWithLimits:53->runCustomFormat:67 » IO Cannot run program ...
  TestJobSysDirWithDFS.testWithDFS:130 » YarnRuntime java.lang.OutOfMemoryError:...
  TestMerge.testMerge:81 » YarnRuntime java.lang.OutOfMemoryError: unable to cre...
  TestNetworkedJob.testGetJobStatus:113 » IO Cannot run program "stat": java.io....
  TestNetworkedJob.testNetworkedJob:133 » IO Cannot run program "stat": java.io....
  TestNetworkedJob.testJobQueueClient:319 » IO Cannot run program "stat": java.i...
  TestMiniMRChildTask.setup:320 » IO Cannot run program "stat": java.io.IOExcept...
  TestReduceFetchFromPartialMem$1>TestSetup.run:27->setUp:61 » YarnRuntime java....
  TestLazyOutput.testLazyOutput:146 » YarnRuntime java.lang.OutOfMemoryError: un...
  TestJobName>ClusterMapReduceTestCase.setUp:56->ClusterMapReduceTestCase.startCluster:86
» YarnRuntime
  TestJobName>ClusterMapReduceTestCase.setUp:56->ClusterMapReduceTestCase.startCluster:86
» YarnRuntime

Tests run: 156, Failures: 2, Errors: 17, Skipped: 6

[INFO] ------------------------------------------------------------------------
[INFO] Reactor Summary:
[INFO] 
[INFO] hadoop-mapreduce-client ........................... SUCCESS [2.663s]
[INFO] hadoop-mapreduce-client-core ...................... SUCCESS [41.053s]
[INFO] hadoop-mapreduce-client-common .................... SUCCESS [24.684s]
[INFO] hadoop-mapreduce-client-shuffle ................... SUCCESS [2.417s]
[INFO] hadoop-mapreduce-client-app ....................... SUCCESS [6:35.179s]
[INFO] hadoop-mapreduce-client-hs ........................ SUCCESS [2:02.714s]
[INFO] hadoop-mapreduce-client-jobclient ................. FAILURE [49:46.445s]
[INFO] hadoop-mapreduce-client-hs-plugins ................ SKIPPED
[INFO] Apache Hadoop MapReduce Examples .................. SKIPPED
[INFO] hadoop-mapreduce .................................. SKIPPED
[INFO] ------------------------------------------------------------------------
[INFO] BUILD FAILURE
[INFO] ------------------------------------------------------------------------
[INFO] Total time: 59:35.803s
[INFO] Finished at: Mon Sep 30 14:18:01 UTC 2013
[INFO] Final Memory: 24M/132M
[INFO] ------------------------------------------------------------------------
[ERROR] Failed to execute goal org.apache.maven.plugins:maven-surefire-plugin:2.16:test (default-test)
on project hadoop-mapreduce-client-jobclient: ExecutionException; nested exception is java.util.concurrent.ExecutionException:
java.lang.RuntimeException: The forked VM terminated without saying properly goodbye. VM crash
or System.exit called ?
[ERROR] Command was/bin/sh -c cd /home/jenkins/jenkins-slave/workspace/Hadoop-Mapreduce-trunk/trunk/hadoop-mapreduce-project/hadoop-mapreduce-client/hadoop-mapreduce-client-jobclient
&& /home/jenkins/tools/java/jdk1.6.0_26/jre/bin/java -Xmx1024m -XX:+HeapDumpOnOutOfMemoryError
-jar /home/jenkins/jenkins-slave/workspace/Hadoop-Mapreduce-trunk/trunk/hadoop-mapreduce-project/hadoop-mapreduce-client/hadoop-mapreduce-client-jobclient/target/surefire/surefirebooter2381981261914589302.jar
/home/jenkins/jenkins-slave/workspace/Hadoop-Mapreduce-trunk/trunk/hadoop-mapreduce-project/hadoop-mapreduce-client/hadoop-mapreduce-client-jobclient/target/surefire/surefire7643784656038177402tmp
/home/jenkins/jenkins-slave/workspace/Hadoop-Mapreduce-trunk/trunk/hadoop-mapreduce-project/hadoop-mapreduce-client/hadoop-mapreduce-client-jobclient/target/surefire/surefire_111250520024082003742tmp
[ERROR] -> [Help 1]
[ERROR] 
[ERROR] To see the full stack trace of the errors, re-run Maven with the -e switch.
[ERROR] Re-run Maven using the -X switch to enable full debug logging.
[ERROR] 
[ERROR] For more information about the errors and possible solutions, please read the following
articles:
[ERROR] [Help 1] http://cwiki.apache.org/confluence/display/MAVEN/MojoFailureException
[ERROR] 
[ERROR] After correcting the problems, you can resume the build with the command
[ERROR]   mvn <goals> -rf :hadoop-mapreduce-client-jobclient
Build step 'Execute shell' marked build as failure
[FINDBUGS] Skipping publisher since build result is FAILURE
Archiving artifacts
Updating HDFS-5256
Email was triggered for: Failure
Sending email for trigger: Failure



###################################################################################
############################## FAILED TESTS (if any) ##############################
No tests ran.
Mime
  • Unnamed multipart/mixed (inline, None, 0 bytes)
View raw message