hadoop-mapreduce-dev mailing list archives

Site index · List index
Message view « Date » · « Thread »
Top « Date » · « Thread »
From Apache Jenkins Server <jenk...@builds.apache.org>
Subject Hadoop-Mapreduce-trunk - Build # 1912 - Still Failing
Date Tue, 30 Sep 2014 15:10:58 GMT
See https://builds.apache.org/job/Hadoop-Mapreduce-trunk/1912/

###################################################################################
########################## LAST 60 LINES OF THE CONSOLE ###########################
[...truncated 28873 lines...]
[INFO] hadoop-mapreduce-client ........................... SUCCESS [  2.770 s]
[INFO] hadoop-mapreduce-client-core ...................... SUCCESS [ 58.654 s]
[INFO] hadoop-mapreduce-client-common .................... SUCCESS [ 27.064 s]
[INFO] hadoop-mapreduce-client-shuffle ................... SUCCESS [  4.350 s]
[INFO] hadoop-mapreduce-client-app ....................... SUCCESS [08:45 min]
[INFO] hadoop-mapreduce-client-hs ........................ SUCCESS [05:11 min]
[INFO] hadoop-mapreduce-client-jobclient ................. FAILURE [  01:31 h]
[INFO] hadoop-mapreduce-client-hs-plugins ................ SKIPPED
[INFO] hadoop-mapreduce-client-nativetask ................ SKIPPED
[INFO] Apache Hadoop MapReduce Examples .................. SKIPPED
[INFO] hadoop-mapreduce .................................. SKIPPED
[INFO] ------------------------------------------------------------------------
[INFO] BUILD FAILURE
[INFO] ------------------------------------------------------------------------
[INFO] Total time: 01:47 h
[INFO] Finished at: 2014-09-30T15:10:12+00:00
[INFO] Final Memory: 40M/607M
[INFO] ------------------------------------------------------------------------
[ERROR] Failed to execute goal org.apache.maven.plugins:maven-surefire-plugin:2.16:test (default-test)
on project hadoop-mapreduce-client-jobclient: There are test failures.
[ERROR] 
[ERROR] Please refer to /home/jenkins/jenkins-slave/workspace/Hadoop-Mapreduce-trunk/hadoop-mapreduce-project/hadoop-mapreduce-client/hadoop-mapreduce-client-jobclient/target/surefire-reports
for the individual test results.
[ERROR] -> [Help 1]
[ERROR] 
[ERROR] To see the full stack trace of the errors, re-run Maven with the -e switch.
[ERROR] Re-run Maven using the -X switch to enable full debug logging.
[ERROR] 
[ERROR] For more information about the errors and possible solutions, please read the following
articles:
[ERROR] [Help 1] http://cwiki.apache.org/confluence/display/MAVEN/MojoFailureException
[ERROR] 
[ERROR] After correcting the problems, you can resume the build with the command
[ERROR]   mvn <goals> -rf :hadoop-mapreduce-client-jobclient
Build step 'Execute shell' marked build as failure
[FINDBUGS] Skipping publisher since build result is FAILURE
Archiving artifacts
Sending artifact delta relative to Hadoop-Mapreduce-trunk #1870
Archived 2 artifacts
Archive block size is 32768
Received 0 blocks and 20206436 bytes
Compression is 0.0%
Took 15 sec
Updating HDFS-4165
Updating HDFS-6779
Updating HDFS-7124
Updating HADOOP-11110
Updating HADOOP-11130
Updating HADOOP-11084
Updating HDFS-4227
Updating HDFS-7157
Updating HADOOP-11153
Updating YARN-2606
Updating MAPREDUCE-6094
Updating MAPREDUCE-6072
Updating HDFS-7122
Updating HDFS-7104
Updating YARN-1769
Updating HADOOP-11049
Updating HDFS-6519
Email was triggered for: Failure
Sending email for trigger: Failure



###################################################################################
############################## FAILED TESTS (if any) ##############################
No tests ran.
Mime
  • Unnamed multipart/mixed (inline, None, 0 bytes)
View raw message