hadoop-mapreduce-dev mailing list archives

Site index · List index
Message view « Date » · « Thread »
Top « Date » · « Thread »
From Apache Jenkins Server <jenk...@builds.apache.org>
Subject Hadoop-Mapreduce-trunk - Build # 1899 - Still Failing
Date Wed, 17 Sep 2014 13:46:58 GMT
See https://builds.apache.org/job/Hadoop-Mapreduce-trunk/1899/

###################################################################################
########################## LAST 60 LINES OF THE CONSOLE ###########################
[...truncated 29147 lines...]
[INFO] Apache Hadoop MapReduce Examples .................. SKIPPED
[INFO] hadoop-mapreduce .................................. SKIPPED
[INFO] Apache Hadoop MapReduce Streaming ................. SKIPPED
[INFO] Apache Hadoop Distributed Copy .................... SKIPPED
[INFO] Apache Hadoop Archives ............................ SKIPPED
[INFO] Apache Hadoop Rumen ............................... SKIPPED
[INFO] Apache Hadoop Gridmix ............................. SKIPPED
[INFO] Apache Hadoop Data Join ........................... SKIPPED
[INFO] Apache Hadoop Extras .............................. SKIPPED
[INFO] Apache Hadoop Pipes ............................... SKIPPED
[INFO] Apache Hadoop OpenStack support ................... SKIPPED
[INFO] Apache Hadoop Amazon Web Services support ......... SKIPPED
[INFO] Apache Hadoop Azure support ....................... SKIPPED
[INFO] Apache Hadoop Client .............................. SKIPPED
[INFO] Apache Hadoop Mini-Cluster ........................ SKIPPED
[INFO] Apache Hadoop Scheduler Load Simulator ............ SKIPPED
[INFO] Apache Hadoop Tools Dist .......................... SKIPPED
[INFO] Apache Hadoop Tools ............................... SKIPPED
[INFO] Apache Hadoop Distribution ........................ SKIPPED
[INFO] ------------------------------------------------------------------------
[INFO] BUILD FAILURE
[INFO] ------------------------------------------------------------------------
[INFO] Total time: 24:18 min
[INFO] Finished at: 2014-09-17T13:46:33+00:00
[INFO] Final Memory: 65M/882M
[INFO] ------------------------------------------------------------------------
[ERROR] Failed to execute goal org.apache.maven.plugins:maven-surefire-plugin:2.16:test (default-test)
on project hadoop-common: There are test failures.
[ERROR] 
[ERROR] Please refer to /home/jenkins/jenkins-slave/workspace/Hadoop-Mapreduce-trunk/hadoop-common-project/hadoop-common/target/surefire-reports
for the individual test results.
[ERROR] -> [Help 1]
[ERROR] 
[ERROR] To see the full stack trace of the errors, re-run Maven with the -e switch.
[ERROR] Re-run Maven using the -X switch to enable full debug logging.
[ERROR] 
[ERROR] For more information about the errors and possible solutions, please read the following
articles:
[ERROR] [Help 1] http://cwiki.apache.org/confluence/display/MAVEN/MojoFailureException
[ERROR] 
[ERROR] After correcting the problems, you can resume the build with the command
[ERROR]   mvn <goals> -rf :hadoop-common
Build step 'Execute shell' marked build as failure
[FINDBUGS] Skipping publisher since build result is FAILURE
Archiving artifacts
Updating HADOOP-11097
Updating HADOOP-11096
Updating HDFS-6880
Updating HADOOP-11055
Updating HADOOP-11062
Updating YARN-2531
Updating YARN-1250
Updating HDFS-6851
Updating YARN-2557
Updating HDFS-6965
Updating HDFS-7006
Updating HADOOP-10922
Updating HDFS-6789
Updating HADOOP-11022
Updating HDFS-6799
Email was triggered for: Failure
Sending email for trigger: Failure



###################################################################################
############################## FAILED TESTS (if any) ##############################
No tests ran.
Mime
  • Unnamed multipart/mixed (inline, None, 0 bytes)
View raw message