hadoop-mapreduce-dev mailing list archives

Site index · List index
Message view « Date » · « Thread »
Top « Date » · « Thread »
From Apache Jenkins Server <jenk...@builds.apache.org>
Subject Hadoop-Mapreduce-trunk-Java8 - Build # 30 - Still Failing
Date Sun, 07 Dec 2014 20:47:24 GMT
See https://builds.apache.org/job/Hadoop-Mapreduce-trunk-Java8/30/

###################################################################################
########################## LAST 60 LINES OF THE CONSOLE ###########################
[...truncated 11879 lines...]
[INFO] hadoop-mapreduce-client-core ...................... SKIPPED
[INFO] hadoop-mapreduce-client-common .................... SKIPPED
[INFO] hadoop-mapreduce-client-shuffle ................... SKIPPED
[INFO] hadoop-mapreduce-client-app ....................... SKIPPED
[INFO] hadoop-mapreduce-client-hs ........................ SKIPPED
[INFO] hadoop-mapreduce-client-jobclient ................. SKIPPED
[INFO] hadoop-mapreduce-client-hs-plugins ................ SKIPPED
[INFO] hadoop-mapreduce-client-nativetask ................ SKIPPED
[INFO] Apache Hadoop MapReduce Examples .................. SKIPPED
[INFO] hadoop-mapreduce .................................. SKIPPED
[INFO] Apache Hadoop MapReduce Streaming ................. SKIPPED
[INFO] Apache Hadoop Distributed Copy .................... SKIPPED
[INFO] Apache Hadoop Archives ............................ SKIPPED
[INFO] Apache Hadoop Rumen ............................... SKIPPED
[INFO] Apache Hadoop Gridmix ............................. SKIPPED
[INFO] Apache Hadoop Data Join ........................... SKIPPED
[INFO] Apache Hadoop Ant Tasks ........................... SKIPPED
[INFO] Apache Hadoop Extras .............................. SKIPPED
[INFO] Apache Hadoop Pipes ............................... SKIPPED
[INFO] Apache Hadoop OpenStack support ................... SKIPPED
[INFO] Apache Hadoop Amazon Web Services support ......... SKIPPED
[INFO] Apache Hadoop Azure support ....................... SKIPPED
[INFO] Apache Hadoop Client .............................. SKIPPED
[INFO] Apache Hadoop Mini-Cluster ........................ SKIPPED
[INFO] Apache Hadoop Scheduler Load Simulator ............ SKIPPED
[INFO] Apache Hadoop Tools Dist .......................... SKIPPED
[INFO] Apache Hadoop Tools ............................... SKIPPED
[INFO] Apache Hadoop Distribution ........................ SKIPPED
[INFO] ------------------------------------------------------------------------
[INFO] BUILD FAILURE
[INFO] ------------------------------------------------------------------------
[INFO] Total time: 02:56 h
[INFO] Finished at: 2014-12-07T20:47:12+00:00
[INFO] Final Memory: 54M/297M
[INFO] ------------------------------------------------------------------------
[ERROR] Failed to execute goal org.apache.maven.plugins:maven-surefire-plugin:2.16:test (default-test)
on project hadoop-hdfs: There are test failures.
[ERROR] 
[ERROR] Please refer to /home/jenkins/jenkins-slave/workspace/Hadoop-Mapreduce-trunk-Java8/hadoop-hdfs-project/hadoop-hdfs/target/surefire-reports
for the individual test results.
[ERROR] -> [Help 1]
[ERROR] 
[ERROR] To see the full stack trace of the errors, re-run Maven with the -e switch.
[ERROR] Re-run Maven using the -X switch to enable full debug logging.
[ERROR] 
[ERROR] For more information about the errors and possible solutions, please read the following
articles:
[ERROR] [Help 1] http://cwiki.apache.org/confluence/display/MAVEN/MojoFailureException
[ERROR] 
[ERROR] After correcting the problems, you can resume the build with the command
[ERROR]   mvn <goals> -rf :hadoop-hdfs
Build step 'Execute shell' marked build as failure
[FINDBUGS] Skipping publisher since build result is FAILURE
Archiving artifacts
Sending artifact delta relative to Hadoop-Mapreduce-trunk-Java8 #28
Archived 1 artifacts
Archive block size is 32768
Received 1 blocks and 20222095 bytes
Compression is 0.2%
Took 9 sec
Email was triggered for: Failure
Sending email for trigger: Failure



###################################################################################
############################## FAILED TESTS (if any) ##############################
No tests ran.
Mime
  • Unnamed multipart/mixed (inline, None, 0 bytes)
View raw message