hadoop-mapreduce-dev mailing list archives

Site index · List index
Message view « Date » · « Thread »
Top « Date » · « Thread »
From Apache Jenkins Server <jenk...@builds.apache.org>
Subject Hadoop-Mapreduce-trunk-Java8 - Build # 24 - Failure
Date Wed, 03 Dec 2014 15:50:54 GMT
See https://builds.apache.org/job/Hadoop-Mapreduce-trunk-Java8/24/

###################################################################################
########################## LAST 60 LINES OF THE CONSOLE ###########################
[...truncated 35754 lines...]

Tests in error: 
  TestMRJobs.testDistributedCache:926->_testDistributedCache:906 »  test timed o...
  TestMRTimelineEventHandling.testMRTimelineEventHandling:121 » IO Job didn't fi...

Tests run: 509, Failures: 0, Errors: 1, Skipped: 11

[INFO] ------------------------------------------------------------------------
[INFO] Reactor Summary:
[INFO] 
[INFO] hadoop-mapreduce-client ........................... SUCCESS [  2.795 s]
[INFO] hadoop-mapreduce-client-core ...................... SUCCESS [01:55 min]
[INFO] hadoop-mapreduce-client-common .................... SUCCESS [ 27.677 s]
[INFO] hadoop-mapreduce-client-shuffle ................... SUCCESS [  4.329 s]
[INFO] hadoop-mapreduce-client-app ....................... SUCCESS [17:20 min]
[INFO] hadoop-mapreduce-client-hs ........................ SUCCESS [06:44 min]
[INFO] hadoop-mapreduce-client-jobclient ................. FAILURE [  01:59 h]
[INFO] hadoop-mapreduce-client-hs-plugins ................ SKIPPED
[INFO] hadoop-mapreduce-client-nativetask ................ SKIPPED
[INFO] Apache Hadoop MapReduce Examples .................. SKIPPED
[INFO] hadoop-mapreduce .................................. SKIPPED
[INFO] ------------------------------------------------------------------------
[INFO] BUILD FAILURE
[INFO] ------------------------------------------------------------------------
[INFO] Total time: 02:26 h
[INFO] Finished at: 2014-12-03T15:50:36+00:00
[INFO] Final Memory: 46M/594M
[INFO] ------------------------------------------------------------------------
[ERROR] Failed to execute goal org.apache.maven.plugins:maven-surefire-plugin:2.16:test (default-test)
on project hadoop-mapreduce-client-jobclient: There was a timeout or other error in the fork
-> [Help 1]
[ERROR] 
[ERROR] To see the full stack trace of the errors, re-run Maven with the -e switch.
[ERROR] Re-run Maven using the -X switch to enable full debug logging.
[ERROR] 
[ERROR] For more information about the errors and possible solutions, please read the following
articles:
[ERROR] [Help 1] http://cwiki.apache.org/confluence/display/MAVEN/MojoFailureException
[ERROR] 
[ERROR] After correcting the problems, you can resume the build with the command
[ERROR]   mvn <goals> -rf :hadoop-mapreduce-client-jobclient
Build step 'Execute shell' marked build as failure
[FINDBUGS] Skipping publisher since build result is FAILURE
Archiving artifacts
Sending artifact delta relative to Hadoop-Mapreduce-trunk-Java8 #23
Archived 2 artifacts
Archive block size is 32768
Received 116 blocks and 16446273 bytes
Compression is 18.8%
Took 8.4 sec
Updating HDFS-7448
Updating HDFS-7446
Updating YARN-2894
Updating YARN-1156
Updating HADOOP-11296
Updating HADOOP-11344
Updating YARN-2472
Updating HDFS-6735
Updating HDFS-7462
Updating YARN-2136
Email was triggered for: Failure
Sending email for trigger: Failure



###################################################################################
############################## FAILED TESTS (if any) ##############################
No tests ran.
Mime
  • Unnamed multipart/mixed (inline, None, 0 bytes)
View raw message