hadoop-mapreduce-dev mailing list archives

Site index · List index
Message view « Date » · « Thread »
Top « Date » · « Thread »
From Apache Jenkins Server <jenk...@builds.apache.org>
Subject Hadoop-Mapreduce-trunk - Build # 1996 - Failure
Date Thu, 18 Dec 2014 15:35:11 GMT
See https://builds.apache.org/job/Hadoop-Mapreduce-trunk/1996/

###################################################################################
########################## LAST 60 LINES OF THE CONSOLE ###########################
[...truncated 30819 lines...]
[INFO] Reactor Summary:
[INFO] 
[INFO] hadoop-mapreduce-client ........................... SUCCESS [  2.695 s]
[INFO] hadoop-mapreduce-client-core ...................... SUCCESS [01:35 min]
[INFO] hadoop-mapreduce-client-common .................... SUCCESS [ 29.287 s]
[INFO] hadoop-mapreduce-client-shuffle ................... SUCCESS [  4.594 s]
[INFO] hadoop-mapreduce-client-app ....................... SUCCESS [14:01 min]
[INFO] hadoop-mapreduce-client-hs ........................ SUCCESS [06:09 min]
[INFO] hadoop-mapreduce-client-jobclient ................. FAILURE [  01:47 h]
[INFO] hadoop-mapreduce-client-hs-plugins ................ SKIPPED
[INFO] hadoop-mapreduce-client-nativetask ................ SKIPPED
[INFO] Apache Hadoop MapReduce Examples .................. SKIPPED
[INFO] hadoop-mapreduce .................................. SKIPPED
[INFO] ------------------------------------------------------------------------
[INFO] BUILD FAILURE
[INFO] ------------------------------------------------------------------------
[INFO] Total time: 02:09 h
[INFO] Finished at: 2014-12-18T15:34:31+00:00
[INFO] Final Memory: 31M/620M
[INFO] ------------------------------------------------------------------------
[ERROR] Failed to execute goal org.apache.maven.plugins:maven-surefire-plugin:2.17:test (default-test)
on project hadoop-mapreduce-client-jobclient: There are test failures.
[ERROR] 
[ERROR] Please refer to /home/jenkins/jenkins-slave/workspace/Hadoop-Mapreduce-trunk/hadoop-mapreduce-project/hadoop-mapreduce-client/hadoop-mapreduce-client-jobclient/target/surefire-reports
for the individual test results.
[ERROR] -> [Help 1]
[ERROR] 
[ERROR] To see the full stack trace of the errors, re-run Maven with the -e switch.
[ERROR] Re-run Maven using the -X switch to enable full debug logging.
[ERROR] 
[ERROR] For more information about the errors and possible solutions, please read the following
articles:
[ERROR] [Help 1] http://cwiki.apache.org/confluence/display/MAVEN/MojoFailureException
[ERROR] 
[ERROR] After correcting the problems, you can resume the build with the command
[ERROR]   mvn <goals> -rf :hadoop-mapreduce-client-jobclient
Build step 'Execute shell' marked build as failure
[FINDBUGS] Skipping publisher since build result is FAILURE
Archiving artifacts
Sending artifact delta relative to Hadoop-Mapreduce-trunk #1995
Archived 1 artifacts
Archive block size is 32768
Received 1 blocks and 20220906 bytes
Compression is 0.2%
Took 6 sec
Recording test results
Updating YARN-2189
Updating YARN-1492
Updating HADOOP-11420
Updating HADOOP-11421
Updating YARN-2964
Updating YARN-2972
Updating HADOOP-11397
Updating HDFS-7528
Updating HADOOP-9629
Updating YARN-2944
Updating HADOOP-11416
Updating HDFS-7531
Updating HADOOP-11358
Updating YARN-2203
Email was triggered for: Failure
Sending email for trigger: Failure



###################################################################################
############################## FAILED TESTS (if any) ##############################
1 tests failed.
REGRESSION:  org.apache.hadoop.mapred.TestMRTimelineEventHandling.testMapreduceJobTimelineServiceEnabled

Error Message:
Job didn't finish in 30 seconds

Stack Trace:
java.io.IOException: Job didn't finish in 30 seconds
	at org.apache.hadoop.mapred.UtilsForTests.runJobSucceed(UtilsForTests.java:622)
	at org.apache.hadoop.mapred.TestMRTimelineEventHandling.testMapreduceJobTimelineServiceEnabled(TestMRTimelineEventHandling.java:116)



Mime
  • Unnamed multipart/mixed (inline, None, 0 bytes)
View raw message