hadoop-mapreduce-dev mailing list archives

Site index · List index
Message view « Date » · « Thread »
Top « Date » · « Thread »
From Apache Jenkins Server <jenk...@builds.apache.org>
Subject Hadoop-Mapreduce-trunk-Java8 - Build # 29 - Failure
Date Sun, 07 Dec 2014 17:18:46 GMT
See https://builds.apache.org/job/Hadoop-Mapreduce-trunk-Java8/29/

###################################################################################
########################## LAST 60 LINES OF THE CONSOLE ###########################
[...truncated 5468 lines...]
and
+-org.apache.hadoop:hadoop-mapreduce-client-common:3.0.0-SNAPSHOT
  +-org.apache.hadoop:hadoop-yarn-server-common:3.0.0-20141207.042421-4571
    +-org.apache.hadoop:hadoop-yarn-common:3.0.0-SNAPSHOT

[WARNING] Rule 0: org.apache.maven.plugins.enforcer.DependencyConvergence failed with message:
Failed while enforcing releasability the error(s) are [
Dependency convergence error for org.apache.hadoop:hadoop-yarn-common:3.0.0-20141207.042418-4577
paths to dependency are:
+-org.apache.hadoop:hadoop-mapreduce-client-common:3.0.0-SNAPSHOT
  +-org.apache.hadoop:hadoop-yarn-common:3.0.0-20141207.042418-4577
and
+-org.apache.hadoop:hadoop-mapreduce-client-common:3.0.0-SNAPSHOT
  +-org.apache.hadoop:hadoop-yarn-client:3.0.0-20141207.042436-3316
    +-org.apache.hadoop:hadoop-yarn-common:3.0.0-SNAPSHOT
and
+-org.apache.hadoop:hadoop-mapreduce-client-common:3.0.0-SNAPSHOT
  +-org.apache.hadoop:hadoop-mapreduce-client-core:3.0.0-SNAPSHOT
    +-org.apache.hadoop:hadoop-yarn-common:3.0.0-SNAPSHOT
and
+-org.apache.hadoop:hadoop-mapreduce-client-common:3.0.0-SNAPSHOT
  +-org.apache.hadoop:hadoop-yarn-server-common:3.0.0-20141207.042421-4571
    +-org.apache.hadoop:hadoop-yarn-common:3.0.0-SNAPSHOT
]
[INFO] ------------------------------------------------------------------------
[INFO] Reactor Summary:
[INFO] 
[INFO] hadoop-mapreduce-client ........................... SUCCESS [  8.290 s]
[INFO] hadoop-mapreduce-client-core ...................... SUCCESS [01:02 min]
[INFO] hadoop-mapreduce-client-common .................... FAILURE [ 25.391 s]
[INFO] hadoop-mapreduce-client-shuffle ................... SKIPPED
[INFO] hadoop-mapreduce-client-app ....................... SKIPPED
[INFO] hadoop-mapreduce-client-hs ........................ SKIPPED
[INFO] hadoop-mapreduce-client-jobclient ................. SKIPPED
[INFO] hadoop-mapreduce-client-hs-plugins ................ SKIPPED
[INFO] hadoop-mapreduce-client-nativetask ................ SKIPPED
[INFO] Apache Hadoop MapReduce Examples .................. SKIPPED
[INFO] hadoop-mapreduce .................................. SKIPPED
[INFO] ------------------------------------------------------------------------
[INFO] BUILD FAILURE
[INFO] ------------------------------------------------------------------------
[INFO] Total time: 01:36 min
[INFO] Finished at: 2014-12-07T17:18:45+00:00
[INFO] Final Memory: 43M/224M
[INFO] ------------------------------------------------------------------------
[ERROR] Failed to execute goal org.apache.maven.plugins:maven-enforcer-plugin:1.3.1:enforce
(depcheck) on project hadoop-mapreduce-client-common: Some Enforcer rules have failed. Look
above for specific messages explaining why the rule failed. -> [Help 1]
[ERROR] 
[ERROR] To see the full stack trace of the errors, re-run Maven with the -e switch.
[ERROR] Re-run Maven using the -X switch to enable full debug logging.
[ERROR] 
[ERROR] For more information about the errors and possible solutions, please read the following
articles:
[ERROR] [Help 1] http://cwiki.apache.org/confluence/display/MAVEN/MojoExecutionException
[ERROR] 
[ERROR] After correcting the problems, you can resume the build with the command
[ERROR]   mvn <goals> -rf :hadoop-mapreduce-client-common
Build step 'Execute shell' marked build as failure
[FINDBUGS] Skipping publisher since build result is FAILURE
Archiving artifacts
Email was triggered for: Failure
Sending email for trigger: Failure



###################################################################################
############################## FAILED TESTS (if any) ##############################
No tests ran.
Mime
  • Unnamed multipart/mixed (inline, None, 0 bytes)
View raw message