hadoop-mapreduce-dev mailing list archives

Site index · List index
Message view « Date » · « Thread »
Top « Date » · « Thread »
From Apache Jenkins Server <jenk...@builds.apache.org>
Subject Hadoop-Mapreduce-trunk - Build # 2047 - Still Failing
Date Fri, 06 Feb 2015 15:22:56 GMT
See https://builds.apache.org/job/Hadoop-Mapreduce-trunk/2047/

###################################################################################
########################## LAST 60 LINES OF THE CONSOLE ###########################
[...truncated 31093 lines...]
[INFO] hadoop-mapreduce-client-common .................... SUCCESS [ 27.642 s]
[INFO] hadoop-mapreduce-client-shuffle ................... SUCCESS [  4.591 s]
[INFO] hadoop-mapreduce-client-app ....................... SUCCESS [09:38 min]
[INFO] hadoop-mapreduce-client-hs ........................ SUCCESS [05:25 min]
[INFO] hadoop-mapreduce-client-jobclient ................. FAILURE [  01:40 h]
[INFO] hadoop-mapreduce-client-hs-plugins ................ SKIPPED
[INFO] hadoop-mapreduce-client-nativetask ................ SKIPPED
[INFO] Apache Hadoop MapReduce Examples .................. SKIPPED
[INFO] hadoop-mapreduce .................................. SKIPPED
[INFO] ------------------------------------------------------------------------
[INFO] BUILD FAILURE
[INFO] ------------------------------------------------------------------------
[INFO] Total time: 01:57 h
[INFO] Finished at: 2015-02-06T15:22:36+00:00
[INFO] Final Memory: 34M/724M
[INFO] ------------------------------------------------------------------------
[ERROR] Failed to execute goal org.apache.maven.plugins:maven-surefire-plugin:2.17:test (default-test)
on project hadoop-mapreduce-client-jobclient: There are test failures.
[ERROR] 
[ERROR] Please refer to /home/jenkins/jenkins-slave/workspace/Hadoop-Mapreduce-trunk/hadoop-mapreduce-project/hadoop-mapreduce-client/hadoop-mapreduce-client-jobclient/target/surefire-reports
for the individual test results.
[ERROR] -> [Help 1]
[ERROR] 
[ERROR] To see the full stack trace of the errors, re-run Maven with the -e switch.
[ERROR] Re-run Maven using the -X switch to enable full debug logging.
[ERROR] 
[ERROR] For more information about the errors and possible solutions, please read the following
articles:
[ERROR] [Help 1] http://cwiki.apache.org/confluence/display/MAVEN/MojoFailureException
[ERROR] 
[ERROR] After correcting the problems, you can resume the build with the command
[ERROR]   mvn <goals> -rf :hadoop-mapreduce-client-jobclient
Build step 'Execute shell' marked build as failure
[FINDBUGS] Skipping publisher since build result is FAILURE
Archiving artifacts
Sending artifact delta relative to Hadoop-Mapreduce-trunk #2031
Archived 1 artifacts
Archive block size is 32768
Received 0 blocks and 20297031 bytes
Compression is 0.0%
Took 5.5 sec
Recording test results
Updating HADOOP-6964
Updating MAPREDUCE-6233
Updating HADOOP-11543
Updating YARN-1582
Updating YARN-1537
Updating HADOOP-7713
Updating YARN-3101
Updating HDFS-7741
Updating HADOOP-9044
Updating YARN-3145
Updating YARN-1904
Updating HDFS-7270
Updating MAPREDUCE-6186
Updating YARN-3149
Updating HDFS-7655
Updating HADOOP-11506
Updating HADOOP-11526
Updating HDFS-7698
Email was triggered for: Failure
Sending email for trigger: Failure



###################################################################################
############################## FAILED TESTS (if any) ##############################
2 tests failed.
REGRESSION:  org.apache.hadoop.mapred.TestMRTimelineEventHandling.testMapreduceJobTimelineServiceEnabled

Error Message:
Job didn't finish in 30 seconds

Stack Trace:
java.io.IOException: Job didn't finish in 30 seconds
	at org.apache.hadoop.mapred.UtilsForTests.runJobSucceed(UtilsForTests.java:622)
	at org.apache.hadoop.mapred.TestMRTimelineEventHandling.testMapreduceJobTimelineServiceEnabled(TestMRTimelineEventHandling.java:155)


FAILED:  org.apache.hadoop.conf.TestJobConf.testNegativeValueForTaskVmem

Error Message:
expected:<1024> but was:<-1>

Stack Trace:
java.lang.AssertionError: expected:<1024> but was:<-1>
	at org.junit.Assert.fail(Assert.java:88)
	at org.junit.Assert.failNotEquals(Assert.java:743)
	at org.junit.Assert.assertEquals(Assert.java:118)
	at org.junit.Assert.assertEquals(Assert.java:555)
	at org.junit.Assert.assertEquals(Assert.java:542)
	at org.apache.hadoop.conf.TestJobConf.testNegativeValueForTaskVmem(TestJobConf.java:111)



Mime
  • Unnamed multipart/mixed (inline, None, 0 bytes)
View raw message