hadoop-mapreduce-dev mailing list archives

Site index · List index
Message view « Date » · « Thread »
Top « Date » · « Thread »
From Apache Jenkins Server <jenk...@builds.apache.org>
Subject Hadoop-Mapreduce-trunk - Build # 2054 - Still Failing
Date Fri, 13 Feb 2015 15:25:49 GMT
See https://builds.apache.org/job/Hadoop-Mapreduce-trunk/2054/

###################################################################################
########################## LAST 60 LINES OF THE CONSOLE ###########################
[...truncated 31146 lines...]
[INFO] Total time: 01:59 h
[INFO] Finished at: 2015-02-13T15:25:17+00:00
[INFO] Final Memory: 33M/760M
[INFO] ------------------------------------------------------------------------
[ERROR] Failed to execute goal org.apache.maven.plugins:maven-surefire-plugin:2.17:test (default-test)
on project hadoop-mapreduce-client-jobclient: There are test failures.
[ERROR] 
[ERROR] Please refer to /home/jenkins/jenkins-slave/workspace/Hadoop-Mapreduce-trunk/hadoop-mapreduce-project/hadoop-mapreduce-client/hadoop-mapreduce-client-jobclient/target/surefire-reports
for the individual test results.
[ERROR] -> [Help 1]
[ERROR] 
[ERROR] To see the full stack trace of the errors, re-run Maven with the -e switch.
[ERROR] Re-run Maven using the -X switch to enable full debug logging.
[ERROR] 
[ERROR] For more information about the errors and possible solutions, please read the following
articles:
[ERROR] [Help 1] http://cwiki.apache.org/confluence/display/MAVEN/MojoFailureException
[ERROR] 
[ERROR] After correcting the problems, you can resume the build with the command
[ERROR]   mvn <goals> -rf :hadoop-mapreduce-client-jobclient
Build step 'Execute shell' marked build as failure
[FINDBUGS] Skipping publisher since build result is FAILURE
Archiving artifacts
Sending artifact delta relative to Hadoop-Mapreduce-trunk #2031
Archived 1 artifacts
Archive block size is 32768
Received 0 blocks and 20303793 bytes
Compression is 0.0%
Took 5.3 sec
Recording test results
Updating HDFS-7694
Updating HADOOP-11565
Updating YARN-2994
Updating MAPREDUCE-6250
Updating HADOOP-11543
Updating YARN-3104
Updating MAPREDUCE-6255
Updating YARN-3158
Updating HDFS-7668
Updating YARN-3157
Updating HDFS-7711
Updating HDFS-7790
Updating YARN-2079
Updating YARN-3179
Updating MAPREDUCE-6221
Updating HADOOP-9869
Updating YARN-2796
Updating HDFS-7684
Updating HDFS-7404
Updating HDFS-7584
Updating HADOOP-11587
Updating HADOOP-11586
Updating HDFS-7322
Updating YARN-3191
Updating YARN-3181
Updating YARN-3164
Updating YARN-3182
Updating HDFS-7704
Updating YARN-3147
Updating YARN-3124
Email was triggered for: Failure
Sending email for trigger: Failure



###################################################################################
############################## FAILED TESTS (if any) ##############################
1 tests failed.
FAILED:  org.apache.hadoop.conf.TestJobConf.testNegativeValueForTaskVmem

Error Message:
expected:<1024> but was:<-1>

Stack Trace:
java.lang.AssertionError: expected:<1024> but was:<-1>
	at org.junit.Assert.fail(Assert.java:88)
	at org.junit.Assert.failNotEquals(Assert.java:743)
	at org.junit.Assert.assertEquals(Assert.java:118)
	at org.junit.Assert.assertEquals(Assert.java:555)
	at org.junit.Assert.assertEquals(Assert.java:542)
	at org.apache.hadoop.conf.TestJobConf.testNegativeValueForTaskVmem(TestJobConf.java:111)



Mime
  • Unnamed multipart/mixed (inline, None, 0 bytes)
View raw message