hadoop-mapreduce-dev mailing list archives

Site index · List index
Message view « Date » · « Thread »
Top « Date » · « Thread »
From Apache Jenkins Server <jenk...@builds.apache.org>
Subject Apache Hadoop qbt Report: trunk+JDK8 on Linux/aarch
Date Sun, 09 Feb 2020 00:21:59 GMT
ARM Build Details : https://builds.apache.org/job/Hadoop-qbt-linux-ARM-trunk/104/

============================ 
CHANGES 
============================ 

[Feb 7, 2020 7:47:59 PM] (ayushsaxena) HDFS-15136. LOG flooding in secure mode when Cookies
are not set in
[Feb 8, 2020 5:03:57 AM] (ayushsaxena) HDFS-15115. Namenode crash caused by NPE in BlockPlacementPolicyDefault


============================ 
TESTS 
============================ 

There are 23753 total tests of which 6 test(s) failed and 2474 test(s) were skipped.  

============================ 
FAILED TESTS 
============================ 

6 tests failed.
FAILED:  org.apache.hadoop.hdfs.server.federation.router.TestRouterFaultTolerant.testWriteWithFailedSubcluster
FAILED:  org.apache.hadoop.tools.dynamometer.TestDynamometerInfra.org.apache.hadoop.tools.dynamometer.TestDynamometerInfra
FAILED:  org.apache.hadoop.yarn.applications.distributedshell.TestDistributedShell.testDSShellWithoutDomainV1_5
FAILED:  org.apache.hadoop.hdfs.server.namenode.ha.TestDelegationTokensWithHA.testObserverReadProxyProviderWithDT
FAILED:  org.apache.hadoop.yarn.applications.distributedshell.TestDistributedShell.testDSShellWithOpportunisticContainers
FAILED:  org.apache.hadoop.yarn.applications.distributedshell.TestDistributedShell.testDSShellWithEnforceExecutionType


Complete test report can be accessed at https://builds.apache.org/job/Hadoop-qbt-linux-ARM-trunk/104/testReport

IN ATTACHMENT COMPRESSED BUILD LOGS.
Mime
View raw message