hadoop-mapreduce-dev mailing list archives

Site index · List index
Message view « Date » · « Thread »
Top « Date » · « Thread »
From Apache Jenkins Server <jenk...@builds.apache.org>
Subject Apache Hadoop qbt Report: trunk+JDK8 on Linux/aarch
Date Fri, 22 May 2020 00:41:20 GMT
ARM Build Details : https://builds.apache.org/job/Hadoop-qbt-linux-ARM-trunk/205/

============================ 
CHANGES 
============================ 

[May 20, 2020 4:23:56 PM] (eyang) YARN-10228. Relax restriction of file path character in
[May 20, 2020 6:51:48 PM] (github) HADOOP-17004. Fixing a formatting issue
[May 21, 2020 1:07:23 AM] (github) HDFS-15353. Use sudo instead of su to allow nologin user
for secure
[May 21, 2020 11:11:44 AM] (snemeth) FS-CS converter: nestedUserQueue with default rule results
in invalid


============================ 
TESTS 
============================ 

There are 24066 total tests of which 6 test(s) failed and 2533 test(s) were skipped.  

============================ 
FAILED TESTS 
============================ 

6 tests failed.
FAILED:  org.apache.hadoop.hdfs.server.balancer.TestBalancerWithHANameNodes.testBalancerWithObserverWithFailedNode
FAILED:  org.apache.hadoop.hdfs.server.datanode.TestBPOfferService.testMissBlocksWhenReregister
FAILED:  org.apache.hadoop.hdfs.server.datanode.TestBPOfferService.org.apache.hadoop.hdfs.server.datanode.TestBPOfferService
FAILED:  org.apache.hadoop.hdfs.server.balancer.TestBalancerWithNodeGroup.testBalancerEndInNoMoveProgress
FAILED:  org.apache.hadoop.yarn.applications.distributedshell.TestDistributedShell.testDSShellWithOpportunisticContainers
FAILED:  org.apache.hadoop.yarn.applications.distributedshell.TestDistributedShell.testDSShellWithEnforceExecutionType


Complete test report can be accessed at https://builds.apache.org/job/Hadoop-qbt-linux-ARM-trunk/205/testReport

IN ATTACHMENT COMPRESSED BUILD LOGS.
Mime
View raw message