hadoop-mapreduce-dev mailing list archives

Site index · List index
Message view « Date » · « Thread »
Top « Date » · « Thread »
From Apache Jenkins Server <jenk...@builds.apache.org>
Subject Apache Hadoop qbt Report: trunk+JDK8 on Linux/aarch
Date Thu, 21 May 2020 00:57:05 GMT
ARM Build Details : https://builds.apache.org/job/Hadoop-qbt-linux-ARM-trunk/204/

============================ 
CHANGES 
============================ 

[May 19, 2020 7:30:07 PM] (github) Hadoop-17015. ABFS: Handling Rename and Delete idempotency
[May 19, 2020 11:47:04 PM] (github) HADOOP-16586. ITestS3GuardFsck, others fails when run
using a local
[May 20, 2020 2:39:40 AM] (yqlin) HDFS-15340. RBF: Implement BalanceProcedureScheduler basic
framework.
[May 20, 2020 6:06:52 AM] (pjoseph) YARN-9606. Set sslfactory for AuthenticatedURL() while
creating
[May 20, 2020 12:42:25 PM] (stevel) HADOOP-16900. Very large files can be truncated when written
through the


============================ 
TESTS 
============================ 

There are 24120 total tests of which 5 test(s) failed and 2534 test(s) were skipped.  

============================ 
FAILED TESTS 
============================ 

5 tests failed.
FAILED:  org.apache.hadoop.hdfs.server.namenode.TestNameNodeRetryCacheMetrics.testRetryCacheMetrics
FAILED:  org.apache.hadoop.hdfs.server.balancer.TestBalancerWithHANameNodes.testBalancerWithObserver
FAILED:  org.apache.hadoop.hdfs.server.balancer.TestBalancerWithNodeGroup.testBalancerEndInNoMoveProgress
FAILED:  org.apache.hadoop.yarn.applications.distributedshell.TestDistributedShell.testDSShellWithOpportunisticContainers
FAILED:  org.apache.hadoop.yarn.applications.distributedshell.TestDistributedShell.testDSShellWithEnforceExecutionType


Complete test report can be accessed at https://builds.apache.org/job/Hadoop-qbt-linux-ARM-trunk/204/testReport

IN ATTACHMENT COMPRESSED BUILD LOGS.
Mime
View raw message