hadoop-mapreduce-dev mailing list archives

Site index · List index
Message view « Date » · « Thread »
Top « Date » · « Thread »
From Apache Jenkins Server <jenk...@builds.apache.org>
Subject Apache Hadoop qbt Report: trunk+JDK8 on Linux/aarch
Date Tue, 26 May 2020 00:56:48 GMT
ARM Build Details : https://builds.apache.org/job/Hadoop-qbt-linux-ARM-trunk/209/

============================ 
CHANGES 
============================ 

No changes


============================ 
TESTS 
============================ 

There are 24123 total tests of which 8 test(s) failed and 2533 test(s) were skipped.  

============================ 
FAILED TESTS 
============================ 

8 tests failed.
FAILED:  org.apache.hadoop.hdfs.server.datanode.TestBPOfferService.testMissBlocksWhenReregister
FAILED:  org.apache.hadoop.hdfs.server.namenode.ha.TestBootstrapAliasmap.testAliasmapBootstrap
FAILED:  org.apache.hadoop.hdfs.server.sps.TestExternalStoragePolicySatisfier.testChooseInSameDatanodeWithONESSDShouldNotChooseIfNoSpace
FAILED:  org.apache.hadoop.hdfs.TestReconstructStripedFile.testErasureCodingWorkerXmitsWeight
FAILED:  org.apache.hadoop.hdfs.TestReconstructStripedFileWithRandomECPolicy.testErasureCodingWorkerXmitsWeight
FAILED:  org.apache.hadoop.hdfs.server.balancer.TestBalancerWithNodeGroup.testBalancerEndInNoMoveProgress
FAILED:  org.apache.hadoop.yarn.applications.distributedshell.TestDistributedShell.testDSShellWithOpportunisticContainers
FAILED:  org.apache.hadoop.yarn.applications.distributedshell.TestDistributedShell.testDSShellWithEnforceExecutionType


Complete test report can be accessed at https://builds.apache.org/job/Hadoop-qbt-linux-ARM-trunk/209/testReport

IN ATTACHMENT COMPRESSED BUILD LOGS.
Mime
View raw message