hadoop-mapreduce-dev mailing list archives

Site index · List index
Message view « Date » · « Thread »
Top « Date » · « Thread »
From Apache Jenkins Server <jenk...@builds.apache.org>
Subject Apache Hadoop qbt Report: trunk+JDK8 on Linux/aarch
Date Thu, 04 Jun 2020 00:49:31 GMT
ARM Build Details : https://builds.apache.org/job/Hadoop-qbt-linux-ARM-trunk/218/

============================ 
CHANGES 
============================ 

[Jun 2, 2020 4:29:15 PM] (snemeth) YARN-10254. CapacityScheduler incorrect User Group Mapping
after leaf
[Jun 2, 2020 5:31:35 PM] (stevel) HADOOP-17016. Adding Common Counters in ABFS (#1991).
[Jun 2, 2020 6:09:26 PM] (github) HDFS-15321. Make DFSAdmin tool to work with
[Jun 2, 2020 6:53:32 PM] (xyao) HADOOP-16828. Zookeeper Delegation Token Manager fetch sequence
number
[Jun 3, 2020 6:46:36 AM] (ayushsaxena) HDFS-14960. TestBalancerWithNodeGroup should not succeed
with
[Jun 3, 2020 7:17:15 AM] (ayushsaxena) HDFS-11041. Unable to unregister FsDatasetState MBean
if DataNode is
[Jun 3, 2020 9:01:37 AM] (github) HADOOP-17056. shelldoc fails in hadoop-common. (#2045)
[Jun 3, 2020 10:37:40 AM] (github) HADOOP-14566. Add seek support for SFTP FileSystem. (#1999)
[Jun 3, 2020 4:07:00 PM] (github) HADOOP-16568. S3A FullCredentialsTokenBinding fails if local
credentials


============================ 
TESTS 
============================ 

There are 24226 total tests of which 21 test(s) failed and 2544 test(s) were skipped.  

============================ 
FAILED TESTS 
============================ 

21 tests failed.
FAILED:  org.apache.hadoop.hdfs.server.federation.security.TestRouterSecurityManager.testCreateCredentials
FAILED:  org.apache.hadoop.hdfs.tools.TestDFSAdminWithHA.testSaveNamespaceNN1DownNN2Down
FAILED:  org.apache.hadoop.hdfs.tools.TestDFSAdminWithHA.testSetBalancerBandwidth
FAILED:  org.apache.hadoop.hdfs.tools.TestDFSAdminWithHA.testFinalizeUpgrade
FAILED:  org.apache.hadoop.hdfs.tools.TestDFSAdminWithHA.testFinalizeUpgradeNN1DownNN2Up
FAILED:  org.apache.hadoop.hdfs.tools.TestDFSAdminWithHA.testRefreshNodesNN1UpNN2Down
FAILED:  org.apache.hadoop.hdfs.tools.TestDFSAdminWithHA.testSaveNamespaceNN1UpNN2Down
FAILED:  org.apache.hadoop.hdfs.tools.TestDFSAdminWithHA.testSetBalancerBandwidthNN1UpNN2Down
FAILED:  org.apache.hadoop.hdfs.tools.TestDFSAdminWithHA.testListOpenFilesNN1DownNN2Up
FAILED:  org.apache.hadoop.hdfs.tools.TestDFSAdminWithHA.testMetaSave
FAILED:  org.apache.hadoop.hdfs.tools.TestDFSAdminWithHA.testRefreshNodes
FAILED:  org.apache.hadoop.hdfs.tools.TestDFSAdminWithHA.testRefreshNodesNN1DownNN2Up
FAILED:  org.apache.hadoop.hdfs.tools.TestDFSAdminWithHA.testSaveNamespace
FAILED:  org.apache.hadoop.hdfs.tools.TestDFSAdminWithHA.testSaveNamespaceNN1DownNN2Up
FAILED:  org.apache.hadoop.hdfs.tools.TestDFSAdminWithHA.testFinalizeUpgradeNN1UpNN2Down
FAILED:  org.apache.hadoop.hdfs.tools.TestDFSAdminWithHA.testSetBalancerBandwidthNN1DownNN2Up
FAILED:  org.apache.hadoop.yarn.server.resourcemanager.scheduler.fair.TestFairScheduler.testSchedulingOnRemovedNode
FAILED:  org.apache.hadoop.hdfs.TestReconstructStripedFile.testErasureCodingWorkerXmitsWeight
FAILED:  org.apache.hadoop.hdfs.TestReconstructStripedFileWithRandomECPolicy.testErasureCodingWorkerXmitsWeight
FAILED:  org.apache.hadoop.yarn.applications.distributedshell.TestDistributedShell.testDSShellWithOpportunisticContainers
FAILED:  org.apache.hadoop.yarn.applications.distributedshell.TestDistributedShell.testDSShellWithEnforceExecutionType


Complete test report can be accessed at https://builds.apache.org/job/Hadoop-qbt-linux-ARM-trunk/218/testReport

IN ATTACHMENT COMPRESSED BUILD LOGS.
Mime
View raw message