hadoop-mapreduce-dev mailing list archives

Site index · List index
Message view « Date » · « Thread »
Top « Date » · « Thread »
From Apache Jenkins Server <jenk...@builds.apache.org>
Subject Apache Hadoop qbt Report: trunk+JDK8 on Linux/aarch
Date Mon, 01 Jun 2020 00:30:26 GMT
ARM Build Details : https://builds.apache.org/job/Hadoop-qbt-linux-ARM-trunk/215/

============================ 
CHANGES 
============================ 

[May 31, 2020 11:40:59 AM] (ayushsaxena) HDFS-10792. RedundantEditLogInputStream should log
caught exceptions.


============================ 
TESTS 
============================ 

There are 24194 total tests of which 9 test(s) failed and 2540 test(s) were skipped.  

============================ 
FAILED TESTS 
============================ 

9 tests failed.
FAILED:  org.apache.hadoop.hdfs.server.federation.security.TestRouterSecurityManager.testCreateCredentials
FAILED:  org.apache.hadoop.hdfs.server.blockmanagement.TestBlockTokenWithDFSStriped.testRead
FAILED:  org.apache.hadoop.hdfs.server.namenode.TestAddOverReplicatedStripedBlocks.testProcessOverReplicatedAndCorruptStripedBlock
FAILED:  org.apache.hadoop.yarn.server.resourcemanager.scheduler.fair.TestFairScheduler.testQueueDemandCalculation
FAILED:  org.apache.hadoop.ipc.TestIPC.testAuxiliaryPorts
FAILED:  org.apache.hadoop.hdfs.TestReconstructStripedFile.testErasureCodingWorkerXmitsWeight
FAILED:  org.apache.hadoop.hdfs.TestReconstructStripedFileWithRandomECPolicy.testErasureCodingWorkerXmitsWeight
FAILED:  org.apache.hadoop.yarn.applications.distributedshell.TestDistributedShell.testDSShellWithOpportunisticContainers
FAILED:  org.apache.hadoop.yarn.applications.distributedshell.TestDistributedShell.testDSShellWithEnforceExecutionType


Complete test report can be accessed at https://builds.apache.org/job/Hadoop-qbt-linux-ARM-trunk/215/testReport

IN ATTACHMENT COMPRESSED BUILD LOGS.
Mime
View raw message