hadoop-mapreduce-dev mailing list archives

Site index · List index
Message view « Date » · « Thread »
Top « Date » · « Thread »
From "Akira Ajisaka (Jira)" <j...@apache.org>
Subject [jira] [Resolved] (MAPREDUCE-7334) TestJobEndNotifier fails
Date Fri, 09 Apr 2021 07:08:00 GMT

     [ https://issues.apache.org/jira/browse/MAPREDUCE-7334?page=com.atlassian.jira.plugin.system.issuetabpanels:all-tabpanel
]

Akira Ajisaka resolved MAPREDUCE-7334.
--------------------------------------
    Fix Version/s: 3.4.0
       Resolution: Fixed

Thank you [~jingzhao]!

> TestJobEndNotifier fails
> ------------------------
>
>                 Key: MAPREDUCE-7334
>                 URL: https://issues.apache.org/jira/browse/MAPREDUCE-7334
>             Project: Hadoop Map/Reduce
>          Issue Type: Bug
>          Components: test
>            Reporter: Akira Ajisaka
>            Assignee: Akira Ajisaka
>            Priority: Major
>              Labels: pull-request-available
>             Fix For: 3.4.0
>
>          Time Spent: 40m
>  Remaining Estimate: 0h
>
> [https://ci-hadoop.apache.org/job/hadoop-multibranch/job/PR-2775/8/artifact/out/patch-unit-hadoop-mapreduce-project_hadoop-mapreduce-client_hadoop-mapreduce-client-core.txt]
> {quote}
> [INFO] Running org.apache.hadoop.mapred.TestJobEndNotifier
> [ERROR] Tests run: 3, Failures: 0, Errors: 1, Skipped: 0, Time elapsed: 47.81 s <<<
FAILURE! - in org.apache.hadoop.mapred.TestJobEndNotifier
> [ERROR] testNotificationTimeout(org.apache.hadoop.mapred.TestJobEndNotifier)  Time elapsed:
47.322 s  <<< ERROR!
> java.util.concurrent.TimeoutException
> 	at org.eclipse.jetty.util.FutureCallback.get(FutureCallback.java:130)
> 	at org.eclipse.jetty.util.FutureCallback.get(FutureCallback.java:30)
> 	at org.eclipse.jetty.server.handler.AbstractHandlerContainer.doShutdown(AbstractHandlerContainer.java:175)
> 	at org.eclipse.jetty.server.Server.doStop(Server.java:447)
> 	at org.eclipse.jetty.util.component.AbstractLifeCycle.stop(AbstractLifeCycle.java:94)
> 	at org.apache.hadoop.http.HttpServer2.stop(HttpServer2.java:1499)
> 	at org.apache.hadoop.mapred.TestJobEndNotifier.tearDown(TestJobEndNotifier.java:127)
> 	at sun.reflect.NativeMethodAccessorImpl.invoke0(Native Method)
> 	at sun.reflect.NativeMethodAccessorImpl.invoke(NativeMethodAccessorImpl.java:62)
> 	at sun.reflect.DelegatingMethodAccessorImpl.invoke(DelegatingMethodAccessorImpl.java:43)
> 	at java.lang.reflect.Method.invoke(Method.java:498)
> 	at org.junit.runners.model.FrameworkMethod$1.runReflectiveCall(FrameworkMethod.java:59)
> 	at org.junit.internal.runners.model.ReflectiveCallable.run(ReflectiveCallable.java:12)
> 	at org.junit.runners.model.FrameworkMethod.invokeExplosively(FrameworkMethod.java:56)
> 	at org.junit.internal.runners.statements.RunAfters.invokeMethod(RunAfters.java:46)
> 	at org.junit.internal.runners.statements.RunAfters.evaluate(RunAfters.java:33)
> 	at org.junit.runners.ParentRunner$3.evaluate(ParentRunner.java:306)
> 	at org.junit.runners.BlockJUnit4ClassRunner$1.evaluate(BlockJUnit4ClassRunner.java:100)
> 	at org.junit.runners.ParentRunner.runLeaf(ParentRunner.java:366)
> 	at org.junit.runners.BlockJUnit4ClassRunner.runChild(BlockJUnit4ClassRunner.java:103)
> 	at org.junit.runners.BlockJUnit4ClassRunner.runChild(BlockJUnit4ClassRunner.java:63)
> 	at org.junit.runners.ParentRunner$4.run(ParentRunner.java:331)
> 	at org.junit.runners.ParentRunner$1.schedule(ParentRunner.java:79)
> 	at org.junit.runners.ParentRunner.runChildren(ParentRunner.java:329)
> 	at org.junit.runners.ParentRunner.access$100(ParentRunner.java:66)
> 	at org.junit.runners.ParentRunner$2.evaluate(ParentRunner.java:293)
> 	at org.junit.runners.ParentRunner$3.evaluate(ParentRunner.java:306)
> 	at org.junit.runners.ParentRunner.run(ParentRunner.java:413)
> 	at org.apache.maven.surefire.junit4.JUnit4Provider.execute(JUnit4Provider.java:365)
> 	at org.apache.maven.surefire.junit4.JUnit4Provider.executeWithRerun(JUnit4Provider.java:273)
> 	at org.apache.maven.surefire.junit4.JUnit4Provider.executeTestSet(JUnit4Provider.java:238)
> 	at org.apache.maven.surefire.junit4.JUnit4Provider.invoke(JUnit4Provider.java:159)
> 	at org.apache.maven.surefire.booter.ForkedBooter.invokeProviderInSameClassLoader(ForkedBooter.java:384)
> 	at org.apache.maven.surefire.booter.ForkedBooter.runSuitesInProcess(ForkedBooter.java:345)
> 	at org.apache.maven.surefire.booter.ForkedBooter.execute(ForkedBooter.java:126)
> 	at org.apache.maven.surefire.booter.ForkedBooter.main(ForkedBooter.java:418)
> {quote}
>  



--
This message was sent by Atlassian Jira
(v8.3.4#803005)

---------------------------------------------------------------------
To unsubscribe, e-mail: mapreduce-dev-unsubscribe@hadoop.apache.org
For additional commands, e-mail: mapreduce-dev-help@hadoop.apache.org


Mime
View raw message