hadoop-yarn-dev mailing list archives

Site index · List index
Message view « Date » · « Thread »
Top « Date » · « Thread »
From Apache Jenkins Server <jenk...@builds.apache.org>
Subject Build failed in Jenkins: Hadoop-Yarn-trunk #1224
Date Tue, 06 Oct 2015 12:12:44 GMT
See <https://builds.apache.org/job/Hadoop-Yarn-trunk/1224/changes>

Changes:

[vinayakumarb] HDFS-7899. Improve EOF error message (Contributed by Jagadesh Kiran N)

------------------------------------------
[...truncated 9861 lines...]
Running org.apache.hadoop.yarn.server.resourcemanager.scheduler.capacity.TestContainerAllocation
Tests run: 6, Failures: 0, Errors: 0, Skipped: 0, Time elapsed: 63.22 sec - in org.apache.hadoop.yarn.server.resourcemanager.scheduler.capacity.TestContainerAllocation
Running org.apache.hadoop.yarn.server.resourcemanager.scheduler.capacity.TestContainerResizing
Tests run: 9, Failures: 0, Errors: 0, Skipped: 0, Time elapsed: 61.225 sec - in org.apache.hadoop.yarn.server.resourcemanager.scheduler.capacity.TestContainerResizing
Running org.apache.hadoop.yarn.server.resourcemanager.scheduler.capacity.TestQueueParsing
Tests run: 17, Failures: 0, Errors: 0, Skipped: 0, Time elapsed: 4.105 sec - in org.apache.hadoop.yarn.server.resourcemanager.scheduler.capacity.TestQueueParsing
Running org.apache.hadoop.yarn.server.resourcemanager.scheduler.capacity.TestQueueCapacities
Tests run: 6, Failures: 0, Errors: 0, Skipped: 0, Time elapsed: 0.246 sec - in org.apache.hadoop.yarn.server.resourcemanager.scheduler.capacity.TestQueueCapacities
Running org.apache.hadoop.yarn.server.resourcemanager.scheduler.capacity.TestLeafQueue
Tests run: 28, Failures: 0, Errors: 0, Skipped: 0, Time elapsed: 21.285 sec - in org.apache.hadoop.yarn.server.resourcemanager.scheduler.capacity.TestLeafQueue
Running org.apache.hadoop.yarn.server.resourcemanager.scheduler.capacity.TestQueueMappings
Tests run: 3, Failures: 0, Errors: 0, Skipped: 0, Time elapsed: 2.424 sec - in org.apache.hadoop.yarn.server.resourcemanager.scheduler.capacity.TestQueueMappings
Running org.apache.hadoop.yarn.server.resourcemanager.scheduler.capacity.TestNodeLabelContainerAllocation
Tests run: 13, Failures: 0, Errors: 0, Skipped: 0, Time elapsed: 286.474 sec - in org.apache.hadoop.yarn.server.resourcemanager.scheduler.capacity.TestNodeLabelContainerAllocation
Running org.apache.hadoop.yarn.server.resourcemanager.scheduler.capacity.TestReservations
Tests run: 9, Failures: 0, Errors: 0, Skipped: 0, Time elapsed: 5.037 sec - in org.apache.hadoop.yarn.server.resourcemanager.scheduler.capacity.TestReservations
Running org.apache.hadoop.yarn.server.resourcemanager.scheduler.capacity.TestWorkPreservingRMRestartForNodeLabel
Tests run: 1, Failures: 0, Errors: 0, Skipped: 0, Time elapsed: 21.754 sec - in org.apache.hadoop.yarn.server.resourcemanager.scheduler.capacity.TestWorkPreservingRMRestartForNodeLabel
Running org.apache.hadoop.yarn.server.resourcemanager.scheduler.capacity.TestCapacitySchedulerNodeLabelUpdate
Tests run: 3, Failures: 0, Errors: 0, Skipped: 0, Time elapsed: 28.221 sec - in org.apache.hadoop.yarn.server.resourcemanager.scheduler.capacity.TestCapacitySchedulerNodeLabelUpdate
Running org.apache.hadoop.yarn.server.resourcemanager.scheduler.capacity.TestCapacitySchedulerQueueACLs
Tests run: 1, Failures: 0, Errors: 0, Skipped: 0, Time elapsed: 16.893 sec - in org.apache.hadoop.yarn.server.resourcemanager.scheduler.capacity.TestCapacitySchedulerQueueACLs
Running org.apache.hadoop.yarn.server.resourcemanager.scheduler.capacity.TestApplicationLimits
Tests run: 5, Failures: 0, Errors: 0, Skipped: 0, Time elapsed: 3.106 sec - in org.apache.hadoop.yarn.server.resourcemanager.scheduler.capacity.TestApplicationLimits
Running org.apache.hadoop.yarn.server.resourcemanager.scheduler.capacity.TestCapacitySchedulerDynamicBehavior
Tests run: 4, Failures: 0, Errors: 0, Skipped: 0, Time elapsed: 6.319 sec - in org.apache.hadoop.yarn.server.resourcemanager.scheduler.capacity.TestCapacitySchedulerDynamicBehavior
Running org.apache.hadoop.yarn.server.resourcemanager.scheduler.capacity.TestChildQueueOrder
Tests run: 1, Failures: 0, Errors: 0, Skipped: 0, Time elapsed: 2.693 sec - in org.apache.hadoop.yarn.server.resourcemanager.scheduler.capacity.TestChildQueueOrder
Running org.apache.hadoop.yarn.server.resourcemanager.scheduler.TestResourceUsage
Tests run: 4, Failures: 0, Errors: 0, Skipped: 0, Time elapsed: 0.533 sec - in org.apache.hadoop.yarn.server.resourcemanager.scheduler.TestResourceUsage
Running org.apache.hadoop.yarn.server.resourcemanager.scheduler.fair.TestFSLeafQueue
Tests run: 5, Failures: 0, Errors: 0, Skipped: 0, Time elapsed: 3.376 sec - in org.apache.hadoop.yarn.server.resourcemanager.scheduler.fair.TestFSLeafQueue
Running org.apache.hadoop.yarn.server.resourcemanager.scheduler.fair.TestQueueManager
Tests run: 3, Failures: 0, Errors: 0, Skipped: 0, Time elapsed: 1.266 sec - in org.apache.hadoop.yarn.server.resourcemanager.scheduler.fair.TestQueueManager
Running org.apache.hadoop.yarn.server.resourcemanager.scheduler.fair.TestContinuousScheduling
Tests run: 1, Failures: 0, Errors: 0, Skipped: 0, Time elapsed: 2.339 sec - in org.apache.hadoop.yarn.server.resourcemanager.scheduler.fair.TestContinuousScheduling
Running org.apache.hadoop.yarn.server.resourcemanager.scheduler.fair.TestAppRunnability
Tests run: 8, Failures: 0, Errors: 0, Skipped: 0, Time elapsed: 3.844 sec - in org.apache.hadoop.yarn.server.resourcemanager.scheduler.fair.TestAppRunnability
Running org.apache.hadoop.yarn.server.resourcemanager.scheduler.fair.TestComputeFairShares
Tests run: 9, Failures: 0, Errors: 0, Skipped: 0, Time elapsed: 0.528 sec - in org.apache.hadoop.yarn.server.resourcemanager.scheduler.fair.TestComputeFairShares
Running org.apache.hadoop.yarn.server.resourcemanager.scheduler.fair.TestFSAppAttempt
Tests run: 4, Failures: 0, Errors: 0, Skipped: 0, Time elapsed: 2.419 sec - in org.apache.hadoop.yarn.server.resourcemanager.scheduler.fair.TestFSAppAttempt
Running org.apache.hadoop.yarn.server.resourcemanager.scheduler.fair.TestFairSchedulerQueueACLs
Tests run: 1, Failures: 0, Errors: 0, Skipped: 0, Time elapsed: 16.337 sec - in org.apache.hadoop.yarn.server.resourcemanager.scheduler.fair.TestFairSchedulerQueueACLs
Running org.apache.hadoop.yarn.server.resourcemanager.scheduler.fair.TestFSParentQueue
Tests run: 1, Failures: 0, Errors: 0, Skipped: 0, Time elapsed: 1.146 sec - in org.apache.hadoop.yarn.server.resourcemanager.scheduler.fair.TestFSParentQueue
Running org.apache.hadoop.yarn.server.resourcemanager.scheduler.fair.TestMaxRunningAppsEnforcer
Tests run: 6, Failures: 0, Errors: 0, Skipped: 0, Time elapsed: 1.633 sec - in org.apache.hadoop.yarn.server.resourcemanager.scheduler.fair.TestMaxRunningAppsEnforcer
Running org.apache.hadoop.yarn.server.resourcemanager.scheduler.fair.TestFairSchedulerConfiguration
Tests run: 5, Failures: 0, Errors: 0, Skipped: 0, Time elapsed: 0.546 sec - in org.apache.hadoop.yarn.server.resourcemanager.scheduler.fair.TestFairSchedulerConfiguration
Running org.apache.hadoop.yarn.server.resourcemanager.scheduler.fair.TestAllocationFileLoaderService
Tests run: 10, Failures: 0, Errors: 0, Skipped: 0, Time elapsed: 1.033 sec - in org.apache.hadoop.yarn.server.resourcemanager.scheduler.fair.TestAllocationFileLoaderService
Running org.apache.hadoop.yarn.server.resourcemanager.scheduler.fair.TestFairSchedulerEventLog
Tests run: 1, Failures: 0, Errors: 0, Skipped: 0, Time elapsed: 1.833 sec - in org.apache.hadoop.yarn.server.resourcemanager.scheduler.fair.TestFairSchedulerEventLog
Running org.apache.hadoop.yarn.server.resourcemanager.scheduler.fair.TestQueuePlacementPolicy
Tests run: 16, Failures: 0, Errors: 0, Skipped: 0, Time elapsed: 0.721 sec - in org.apache.hadoop.yarn.server.resourcemanager.scheduler.fair.TestQueuePlacementPolicy
Running org.apache.hadoop.yarn.server.resourcemanager.scheduler.fair.TestSchedulingPolicy
Tests run: 2, Failures: 0, Errors: 0, Skipped: 0, Time elapsed: 0.77 sec - in org.apache.hadoop.yarn.server.resourcemanager.scheduler.fair.TestSchedulingPolicy
Running org.apache.hadoop.yarn.server.resourcemanager.scheduler.fair.policies.TestEmptyQueues
Tests run: 3, Failures: 0, Errors: 0, Skipped: 0, Time elapsed: 0.573 sec - in org.apache.hadoop.yarn.server.resourcemanager.scheduler.fair.policies.TestEmptyQueues
Running org.apache.hadoop.yarn.server.resourcemanager.scheduler.fair.policies.TestDominantResourceFairnessPolicy
Tests run: 9, Failures: 0, Errors: 0, Skipped: 0, Time elapsed: 0.56 sec - in org.apache.hadoop.yarn.server.resourcemanager.scheduler.fair.policies.TestDominantResourceFairnessPolicy
Running org.apache.hadoop.yarn.server.resourcemanager.scheduler.fair.TestFairScheduler
Tests run: 86, Failures: 0, Errors: 0, Skipped: 0, Time elapsed: 14.317 sec - in org.apache.hadoop.yarn.server.resourcemanager.scheduler.fair.TestFairScheduler
Running org.apache.hadoop.yarn.server.resourcemanager.scheduler.fair.TestFairSchedulerPreemption
Tests run: 1, Failures: 0, Errors: 0, Skipped: 0, Time elapsed: 2.773 sec - in org.apache.hadoop.yarn.server.resourcemanager.scheduler.fair.TestFairSchedulerPreemption
Running org.apache.hadoop.yarn.server.resourcemanager.scheduler.fair.TestSchedulingUpdate
Tests run: 1, Failures: 0, Errors: 0, Skipped: 0, Time elapsed: 1.882 sec - in org.apache.hadoop.yarn.server.resourcemanager.scheduler.fair.TestSchedulingUpdate
Running org.apache.hadoop.yarn.server.resourcemanager.scheduler.fair.TestFairSchedulerFairShare
Tests run: 6, Failures: 0, Errors: 0, Skipped: 0, Time elapsed: 4.033 sec - in org.apache.hadoop.yarn.server.resourcemanager.scheduler.fair.TestFairSchedulerFairShare
Running org.apache.hadoop.yarn.server.resourcemanager.TestClientRMService
Tests run: 19, Failures: 0, Errors: 0, Skipped: 0, Time elapsed: 12.136 sec - in org.apache.hadoop.yarn.server.resourcemanager.TestClientRMService
Running org.apache.hadoop.yarn.server.resourcemanager.TestClientRMTokens
Tests run: 6, Failures: 0, Errors: 0, Skipped: 0, Time elapsed: 18.102 sec - in org.apache.hadoop.yarn.server.resourcemanager.TestClientRMTokens
Running org.apache.hadoop.yarn.server.resourcemanager.TestRMAuditLogger
Tests run: 3, Failures: 0, Errors: 0, Skipped: 0, Time elapsed: 1.327 sec - in org.apache.hadoop.yarn.server.resourcemanager.TestRMAuditLogger
Running org.apache.hadoop.yarn.server.resourcemanager.security.TestDelegationTokenRenewerLifecycle
Tests run: 1, Failures: 0, Errors: 0, Skipped: 0, Time elapsed: 0.785 sec - in org.apache.hadoop.yarn.server.resourcemanager.security.TestDelegationTokenRenewerLifecycle
Running org.apache.hadoop.yarn.server.resourcemanager.security.TestAMRMTokens
Tests run: 6, Failures: 0, Errors: 0, Skipped: 0, Time elapsed: 59.542 sec - in org.apache.hadoop.yarn.server.resourcemanager.security.TestAMRMTokens
Running org.apache.hadoop.yarn.server.resourcemanager.security.TestClientToAMTokens
Tests run: 4, Failures: 0, Errors: 0, Skipped: 0, Time elapsed: 14.034 sec - in org.apache.hadoop.yarn.server.resourcemanager.security.TestClientToAMTokens
Running org.apache.hadoop.yarn.server.resourcemanager.security.TestDelegationTokenRenewer
Tests run: 14, Failures: 0, Errors: 0, Skipped: 0, Time elapsed: 88.024 sec - in org.apache.hadoop.yarn.server.resourcemanager.security.TestDelegationTokenRenewer
Running org.apache.hadoop.yarn.server.resourcemanager.security.TestRMDelegationTokens
Tests run: 2, Failures: 0, Errors: 0, Skipped: 0, Time elapsed: 6.21 sec - in org.apache.hadoop.yarn.server.resourcemanager.security.TestRMDelegationTokens
Running org.apache.hadoop.yarn.server.resourcemanager.TestWorkPreservingRMRestart
Tests run: 28, Failures: 0, Errors: 0, Skipped: 0, Time elapsed: 285.1 sec - in org.apache.hadoop.yarn.server.resourcemanager.TestWorkPreservingRMRestart
Running org.apache.hadoop.yarn.server.resourcemanager.resource.TestResourceWeights
Tests run: 1, Failures: 0, Errors: 0, Skipped: 0, Time elapsed: 0.078 sec - in org.apache.hadoop.yarn.server.resourcemanager.resource.TestResourceWeights
Running org.apache.hadoop.yarn.server.resourcemanager.resource.TestResources
Tests run: 2, Failures: 0, Errors: 0, Skipped: 0, Time elapsed: 0.514 sec - in org.apache.hadoop.yarn.server.resourcemanager.resource.TestResources
Running org.apache.hadoop.yarn.server.resourcemanager.monitor.TestSchedulingMonitor
Tests run: 1, Failures: 0, Errors: 0, Skipped: 0, Time elapsed: 1.796 sec - in org.apache.hadoop.yarn.server.resourcemanager.monitor.TestSchedulingMonitor
Running org.apache.hadoop.yarn.server.resourcemanager.monitor.capacity.TestProportionalCapacityPreemptionPolicy
Tests run: 27, Failures: 0, Errors: 0, Skipped: 0, Time elapsed: 16.055 sec - in org.apache.hadoop.yarn.server.resourcemanager.monitor.capacity.TestProportionalCapacityPreemptionPolicy
Running org.apache.hadoop.yarn.server.resourcemanager.monitor.capacity.TestProportionalCapacityPreemptionPolicyForNodePartitions
Tests run: 11, Failures: 0, Errors: 0, Skipped: 0, Time elapsed: 5.971 sec - in org.apache.hadoop.yarn.server.resourcemanager.monitor.capacity.TestProportionalCapacityPreemptionPolicyForNodePartitions
Running org.apache.hadoop.yarn.server.resourcemanager.placement.TestUserGroupMappingPlacementRule
Tests run: 1, Failures: 0, Errors: 0, Skipped: 0, Time elapsed: 0.902 sec - in org.apache.hadoop.yarn.server.resourcemanager.placement.TestUserGroupMappingPlacementRule
Running org.apache.hadoop.yarn.server.resourcemanager.resourcetracker.TestRMNMRPCResponseId
Tests run: 1, Failures: 0, Errors: 0, Skipped: 0, Time elapsed: 1.609 sec - in org.apache.hadoop.yarn.server.resourcemanager.resourcetracker.TestRMNMRPCResponseId
Running org.apache.hadoop.yarn.server.resourcemanager.resourcetracker.TestNMExpiry
Tests run: 1, Failures: 0, Errors: 0, Skipped: 0, Time elapsed: 3.026 sec - in org.apache.hadoop.yarn.server.resourcemanager.resourcetracker.TestNMExpiry
Running org.apache.hadoop.yarn.server.resourcemanager.resourcetracker.TestNMReconnect
Tests run: 3, Failures: 0, Errors: 0, Skipped: 0, Time elapsed: 2.472 sec - in org.apache.hadoop.yarn.server.resourcemanager.resourcetracker.TestNMReconnect
Running org.apache.hadoop.yarn.server.resourcemanager.applicationsmanager.TestAMRestart
Tests run: 7, Failures: 0, Errors: 0, Skipped: 0, Time elapsed: 149.978 sec - in org.apache.hadoop.yarn.server.resourcemanager.applicationsmanager.TestAMRestart
Running org.apache.hadoop.yarn.server.resourcemanager.applicationsmanager.TestAMRMRPCNodeUpdates
Tests run: 1, Failures: 0, Errors: 0, Skipped: 0, Time elapsed: 9.184 sec - in org.apache.hadoop.yarn.server.resourcemanager.applicationsmanager.TestAMRMRPCNodeUpdates
Running org.apache.hadoop.yarn.server.resourcemanager.applicationsmanager.TestAMRMRPCResponseId
Tests run: 1, Failures: 0, Errors: 0, Skipped: 0, Time elapsed: 5.718 sec - in org.apache.hadoop.yarn.server.resourcemanager.applicationsmanager.TestAMRMRPCResponseId
Running org.apache.hadoop.yarn.server.resourcemanager.TestRMAdminService
Tests run: 21, Failures: 0, Errors: 0, Skipped: 0, Time elapsed: 12.472 sec - in org.apache.hadoop.yarn.server.resourcemanager.TestRMAdminService
Running org.apache.hadoop.yarn.server.resourcemanager.TestRM
Tests run: 22, Failures: 0, Errors: 0, Skipped: 0, Time elapsed: 188.179 sec - in org.apache.hadoop.yarn.server.resourcemanager.TestRM
Running org.apache.hadoop.yarn.server.resourcemanager.rmapp.TestNodesListManager
Tests run: 4, Failures: 0, Errors: 0, Skipped: 0, Time elapsed: 12.918 sec - in org.apache.hadoop.yarn.server.resourcemanager.rmapp.TestNodesListManager
Running org.apache.hadoop.yarn.server.resourcemanager.rmapp.attempt.TestAMLivelinessMonitor
Tests run: 1, Failures: 0, Errors: 0, Skipped: 0, Time elapsed: 1.845 sec - in org.apache.hadoop.yarn.server.resourcemanager.rmapp.attempt.TestAMLivelinessMonitor
Running org.apache.hadoop.yarn.server.resourcemanager.rmapp.attempt.TestRMAppAttemptTransitions
Tests run: 72, Failures: 0, Errors: 0, Skipped: 1, Time elapsed: 5.908 sec - in org.apache.hadoop.yarn.server.resourcemanager.rmapp.attempt.TestRMAppAttemptTransitions
Running org.apache.hadoop.yarn.server.resourcemanager.rmapp.TestRMAppTransitions
Tests run: 44, Failures: 0, Errors: 0, Skipped: 0, Time elapsed: 3.433 sec - in org.apache.hadoop.yarn.server.resourcemanager.rmapp.TestRMAppTransitions
Running org.apache.hadoop.yarn.server.resourcemanager.TestResourceManager
Tests run: 5, Failures: 0, Errors: 0, Skipped: 0, Time elapsed: 4.488 sec - in org.apache.hadoop.yarn.server.resourcemanager.TestResourceManager
Running org.apache.hadoop.yarn.server.resourcemanager.TestApplicationCleanup
Tests run: 7, Failures: 0, Errors: 0, Skipped: 0, Time elapsed: 42.079 sec - in org.apache.hadoop.yarn.server.resourcemanager.TestApplicationCleanup
Running org.apache.hadoop.yarn.server.resourcemanager.TestApplicationMasterLauncher
Tests run: 4, Failures: 0, Errors: 0, Skipped: 0, Time elapsed: 21.046 sec - in org.apache.hadoop.yarn.server.resourcemanager.TestApplicationMasterLauncher
Running org.apache.hadoop.yarn.server.resourcemanager.TestRMDispatcher
Tests run: 1, Failures: 0, Errors: 0, Skipped: 0, Time elapsed: 1.913 sec - in org.apache.hadoop.yarn.server.resourcemanager.TestRMDispatcher
Running org.apache.hadoop.yarn.server.resourcemanager.TestRMHAForNodeLabels
Tests run: 1, Failures: 0, Errors: 0, Skipped: 0, Time elapsed: 3.982 sec - in org.apache.hadoop.yarn.server.resourcemanager.TestRMHAForNodeLabels
Running org.apache.hadoop.yarn.server.resourcemanager.recovery.TestZKRMStateStore
Tests run: 5, Failures: 0, Errors: 0, Skipped: 0, Time elapsed: 13.172 sec - in org.apache.hadoop.yarn.server.resourcemanager.recovery.TestZKRMStateStore
Running org.apache.hadoop.yarn.server.resourcemanager.recovery.TestProtos
Tests run: 1, Failures: 0, Errors: 0, Skipped: 0, Time elapsed: 0.227 sec - in org.apache.hadoop.yarn.server.resourcemanager.recovery.TestProtos
Running org.apache.hadoop.yarn.server.resourcemanager.recovery.TestLeveldbRMStateStore
Tests run: 9, Failures: 0, Errors: 0, Skipped: 0, Time elapsed: 5.106 sec - in org.apache.hadoop.yarn.server.resourcemanager.recovery.TestLeveldbRMStateStore
Running org.apache.hadoop.yarn.server.resourcemanager.recovery.TestFSRMStateStore
Tests run: 4, Failures: 0, Errors: 0, Skipped: 0, Time elapsed: 30.349 sec - in org.apache.hadoop.yarn.server.resourcemanager.recovery.TestFSRMStateStore
Running org.apache.hadoop.yarn.server.resourcemanager.recovery.TestZKRMStateStoreZKClientConnections
Tests run: 5, Failures: 0, Errors: 0, Skipped: 0, Time elapsed: 9.722 sec - in org.apache.hadoop.yarn.server.resourcemanager.recovery.TestZKRMStateStoreZKClientConnections
Running org.apache.hadoop.yarn.server.resourcemanager.recovery.TestZKRMStateStorePerf
Tests run: 1, Failures: 0, Errors: 0, Skipped: 0, Time elapsed: 56.826 sec - in org.apache.hadoop.yarn.server.resourcemanager.recovery.TestZKRMStateStorePerf
Running org.apache.hadoop.yarn.server.resourcemanager.TestRMRestart
Tests run: 48, Failures: 0, Errors: 0, Skipped: 0, Time elapsed: 373.589 sec - in org.apache.hadoop.yarn.server.resourcemanager.TestRMRestart
Running org.apache.hadoop.yarn.server.resourcemanager.TestMoveApplication
Tests run: 4, Failures: 0, Errors: 0, Skipped: 0, Time elapsed: 4.094 sec - in org.apache.hadoop.yarn.server.resourcemanager.TestMoveApplication
Running org.apache.hadoop.yarn.server.resourcemanager.TestRMHA
Tests run: 9, Failures: 0, Errors: 0, Skipped: 0, Time elapsed: 36.399 sec - in org.apache.hadoop.yarn.server.resourcemanager.TestRMHA
Running org.apache.hadoop.yarn.server.resourcemanager.TestRMProxyUsersConf
Tests run: 3, Failures: 0, Errors: 0, Skipped: 0, Time elapsed: 32.441 sec - in org.apache.hadoop.yarn.server.resourcemanager.TestRMProxyUsersConf
Running org.apache.hadoop.yarn.server.resourcemanager.nodelabels.TestRMNodeLabelsManager
Tests run: 10, Failures: 0, Errors: 0, Skipped: 0, Time elapsed: 2.546 sec - in org.apache.hadoop.yarn.server.resourcemanager.nodelabels.TestRMNodeLabelsManager
Running org.apache.hadoop.yarn.server.resourcemanager.logaggregationstatus.TestRMAppLogAggregationStatus
Tests run: 2, Failures: 0, Errors: 0, Skipped: 0, Time elapsed: 3.047 sec - in org.apache.hadoop.yarn.server.resourcemanager.logaggregationstatus.TestRMAppLogAggregationStatus
Running org.apache.hadoop.yarn.server.resourcemanager.TestApplicationACLs
Tests run: 1, Failures: 0, Errors: 0, Skipped: 0, Time elapsed: 8.639 sec - in org.apache.hadoop.yarn.server.resourcemanager.TestApplicationACLs
Running org.apache.hadoop.yarn.server.resourcemanager.metrics.TestSystemMetricsPublisher
Tests run: 3, Failures: 0, Errors: 0, Skipped: 0, Time elapsed: 6.334 sec - in org.apache.hadoop.yarn.server.resourcemanager.metrics.TestSystemMetricsPublisher
Running org.apache.hadoop.yarn.server.resourcemanager.TestKillApplicationWithRMHA
Tests run: 4, Failures: 0, Errors: 0, Skipped: 0, Time elapsed: 26.254 sec - in org.apache.hadoop.yarn.server.resourcemanager.TestKillApplicationWithRMHA

Results :

Tests in error: 
  TestRMWebServicesAppsModification.<init>:291->getSimpleAuthInjectorCap:228 » NoClassDefFound
  TestRMWebServicesAppsModification.<init>:277->JerseyTestBase.<init>:30->JerseyTest.<init>:217->JerseyTest.getContainer:342
» TestContainer
  TestRMWebServicesAppsModification.<init>:277->JerseyTestBase.<init>:30->JerseyTest.<init>:217->JerseyTest.getContainer:342
» TestContainer
  TestRMWebServicesAppsModification.<init>:277->JerseyTestBase.<init>:30->JerseyTest.<init>:217->JerseyTest.getContainer:342
» TestContainer
  TestRMWebServicesAppsModification.<init>:277->JerseyTestBase.<init>:30->JerseyTest.<init>:217->JerseyTest.getContainer:342
» TestContainer
  TestRMWebServicesAppsModification.<init>:277->JerseyTestBase.<init>:30->JerseyTest.<init>:217->JerseyTest.getContainer:342
» TestContainer
  TestRMWebServicesAppsModification.<init>:277->JerseyTestBase.<init>:30->JerseyTest.<init>:217->JerseyTest.getContainer:342
» TestContainer
  TestRMWebServicesAppsModification.<init>:277->JerseyTestBase.<init>:30->JerseyTest.<init>:217->JerseyTest.getContainer:342
» TestContainer
  TestRMWebServicesAppsModification.<init>:277->JerseyTestBase.<init>:30->JerseyTest.<init>:217->JerseyTest.getContainer:342
» TestContainer
  TestRMWebServicesAppsModification.<init>:277->JerseyTestBase.<init>:30->JerseyTest.<init>:217->JerseyTest.getContainer:342
» TestContainer
  TestRMWebServicesAppsModification.<init>:277->JerseyTestBase.<init>:30->JerseyTest.<init>:217->JerseyTest.getContainer:342
» TestContainer
  TestRMWebServicesAppsModification.<init>:277->JerseyTestBase.<init>:30->JerseyTest.<init>:217->JerseyTest.getContainer:342
» TestContainer
  TestRMWebServicesAppsModification.<init>:277->JerseyTestBase.<init>:30->JerseyTest.<init>:217->JerseyTest.getContainer:342
» TestContainer
  TestRMWebServicesAppsModification.<init>:277->JerseyTestBase.<init>:30->JerseyTest.<init>:217->JerseyTest.getContainer:342
» TestContainer
  TestRMWebServicesAppsModification.<init>:277->JerseyTestBase.<init>:30->JerseyTest.<init>:217->JerseyTest.getContainer:342
» TestContainer
  TestRMWebServicesAppsModification.<init>:277->JerseyTestBase.<init>:30->JerseyTest.<init>:217->JerseyTest.getContainer:342
» TestContainer
  TestRMWebServicesAppsModification.<init>:277->JerseyTestBase.<init>:30->JerseyTest.<init>:217->JerseyTest.getContainer:342
» TestContainer
  TestRMWebServicesAppsModification.<init>:277->JerseyTestBase.<init>:30->JerseyTest.<init>:217->JerseyTest.getContainer:342
» TestContainer
  TestRMWebServicesAppsModification.<init>:277->JerseyTestBase.<init>:30->JerseyTest.<init>:217->JerseyTest.getContainer:342
» TestContainer
  TestRMWebServicesAppsModification.<init>:277->JerseyTestBase.<init>:30->JerseyTest.<init>:217->JerseyTest.getContainer:342
» TestContainer
  TestRMWebServicesAppsModification.<init>:277->JerseyTestBase.<init>:30->JerseyTest.<init>:217->JerseyTest.getContainer:342
» TestContainer
  TestRMWebServicesAppsModification.<init>:277->JerseyTestBase.<init>:30->JerseyTest.<init>:217->JerseyTest.getContainer:342
» TestContainer
  TestRMWebServicesAppsModification.<init>:277->JerseyTestBase.<init>:30->JerseyTest.<init>:217->JerseyTest.getContainer:342
» TestContainer
  TestRMWebServicesAppsModification.<init>:277->JerseyTestBase.<init>:30->JerseyTest.<init>:217->JerseyTest.getContainer:342
» TestContainer
  TestRMWebServicesAppsModification.<init>:277->JerseyTestBase.<init>:30->JerseyTest.<init>:217->JerseyTest.getContainer:342
» TestContainer
  TestRMWebServicesAppsModification.<init>:277->JerseyTestBase.<init>:30->JerseyTest.<init>:217->JerseyTest.getContainer:342
» TestContainer
  TestRMWebServicesAppsModification.<init>:277->JerseyTestBase.<init>:30->JerseyTest.<init>:217->JerseyTest.getContainer:342
» TestContainer
  TestRMWebServicesAppsModification.<init>:277->JerseyTestBase.<init>:30->JerseyTest.<init>:217->JerseyTest.getContainer:342
» TestContainer
  TestRMWebServicesAppsModification.<init>:277->JerseyTestBase.<init>:30->JerseyTest.<init>:217->JerseyTest.getContainer:342
» TestContainer
  TestRMWebServicesAppsModification.<init>:277->JerseyTestBase.<init>:30->JerseyTest.<init>:217->JerseyTest.getContainer:342
» TestContainer
  TestRMWebServicesAppsModification.<init>:277->JerseyTestBase.<init>:30->JerseyTest.<init>:217->JerseyTest.getContainer:342
» TestContainer
  TestRMWebServicesAppsModification.<init>:277->JerseyTestBase.<init>:30->JerseyTest.<init>:217->JerseyTest.getContainer:342
» TestContainer
  TestRMWebServicesAppsModification.<init>:277->JerseyTestBase.<init>:30->JerseyTest.<init>:217->JerseyTest.getContainer:342
» TestContainer

Tests run: 1204, Failures: 0, Errors: 33, Skipped: 1

[INFO] ------------------------------------------------------------------------
[INFO] Reactor Summary:
[INFO] 
[INFO] Apache Hadoop YARN ................................ SUCCESS [  3.256 s]
[INFO] Apache Hadoop YARN API ............................ SUCCESS [03:59 min]
[INFO] Apache Hadoop YARN Common ......................... SUCCESS [02:59 min]
[INFO] Apache Hadoop YARN Server ......................... SUCCESS [  0.089 s]
[INFO] Apache Hadoop YARN Server Common .................. SUCCESS [ 46.049 s]
[INFO] Apache Hadoop YARN NodeManager .................... SUCCESS [09:09 min]
[INFO] Apache Hadoop YARN Web Proxy ...................... SUCCESS [ 26.152 s]
[INFO] Apache Hadoop YARN ApplicationHistoryService ...... SUCCESS [03:21 min]
[INFO] Apache Hadoop YARN ResourceManager ................ FAILURE [53:33 min]
[INFO] Apache Hadoop YARN Server Tests ................... SKIPPED
[INFO] Apache Hadoop YARN Client ......................... SKIPPED
[INFO] Apache Hadoop YARN SharedCacheManager ............. SKIPPED
[INFO] Apache Hadoop YARN Applications ................... SKIPPED
[INFO] Apache Hadoop YARN DistributedShell ............... SKIPPED
[INFO] Apache Hadoop YARN Unmanaged Am Launcher .......... SKIPPED
[INFO] Apache Hadoop YARN Site ........................... SKIPPED
[INFO] Apache Hadoop YARN Registry ....................... SKIPPED
[INFO] Apache Hadoop YARN Project ........................ SKIPPED
[INFO] ------------------------------------------------------------------------
[INFO] BUILD FAILURE
[INFO] ------------------------------------------------------------------------
[INFO] Total time: 01:14 h
[INFO] Finished at: 2015-10-06T12:13:13+00:00
[INFO] Final Memory: 61M/530M
[INFO] ------------------------------------------------------------------------
[ERROR] Failed to execute goal org.apache.maven.plugins:maven-surefire-plugin:2.17:test (default-test)
on project hadoop-yarn-server-resourcemanager: There are test failures.
[ERROR] 
[ERROR] Please refer to <https://builds.apache.org/job/Hadoop-Yarn-trunk/ws/hadoop-yarn-project/hadoop-yarn/hadoop-yarn-server/hadoop-yarn-server-resourcemanager/target/surefire-reports>
for the individual test results.
[ERROR] -> [Help 1]
[ERROR] 
[ERROR] To see the full stack trace of the errors, re-run Maven with the -e switch.
[ERROR] Re-run Maven using the -X switch to enable full debug logging.
[ERROR] 
[ERROR] For more information about the errors and possible solutions, please read the following
articles:
[ERROR] [Help 1] http://cwiki.apache.org/confluence/display/MAVEN/MojoFailureException
[ERROR] 
[ERROR] After correcting the problems, you can resume the build with the command
[ERROR]   mvn <goals> -rf :hadoop-yarn-server-resourcemanager
Build step 'Execute shell' marked build as failure
Archiving artifacts
Recording test results
Updating HDFS-7899

Mime
View raw message