hadoop-yarn-dev mailing list archives

Site index · List index
Message view « Date » · « Thread »
Top « Date » · « Thread »
From Apache Jenkins Server <jenk...@builds.apache.org>
Subject Apache Hadoop qbt Report: trunk+JDK8 on Linux/aarch
Date Thu, 27 Feb 2020 00:34:17 GMT
ARM Build Details : https://builds.apache.org/job/Hadoop-qbt-linux-ARM-trunk/121/

============================ 
CHANGES 
============================ 

[Feb 25, 2020 8:30:04 PM] (snemeth) YARN-10130. FS-CS converter: Do not allow output dir to
be the same as
[Feb 25, 2020 8:48:16 PM] (snemeth) YARN-8767. TestStreamingStatus fails. Contributed by Andras
Bokor
[Feb 25, 2020 9:28:50 PM] (weichiu) HDFS-14861. Reset LowRedundancyBlocks Iterator periodically.
Contributed
[Feb 26, 2020 8:29:26 AM] (github) YARN-10156. Fix typo 'complaint' which means quite different
in
[Feb 26, 2020 9:34:29 AM] (pjoseph) YARN-9593. Support Comma in the value of Scheduler Configuration
[Feb 26, 2020 3:33:29 PM] (kihwal) HDFS-15147. LazyPersistTestCase wait logic is flawed. Contributed
by


============================ 
TESTS 
============================ 

There are 23794 total tests of which 3 test(s) failed and 2480 test(s) were skipped.  

============================ 
FAILED TESTS 
============================ 

3 tests failed.
FAILED:  org.apache.hadoop.yarn.csi.client.TestCsiClient.testIdentityService
FAILED:  org.apache.hadoop.yarn.applications.distributedshell.TestDistributedShell.testDSShellWithOpportunisticContainers
FAILED:  org.apache.hadoop.yarn.applications.distributedshell.TestDistributedShell.testDSShellWithEnforceExecutionType


Complete test report can be accessed at https://builds.apache.org/job/Hadoop-qbt-linux-ARM-trunk/121/testReport

IN ATTACHMENT COMPRESSED BUILD LOGS.
Mime
View raw message