hadoop-yarn-dev mailing list archives

Site index · List index
Message view « Date » · « Thread »
Top « Date » · « Thread »
From "Akira Ajisaka (Jira)" <j...@apache.org>
Subject [jira] [Created] (YARN-10662) [JDK 11] TestTimelineReaderWebServicesHBaseStorage fails
Date Tue, 02 Mar 2021 07:25:00 GMT
Akira Ajisaka created YARN-10662:
------------------------------------

             Summary: [JDK 11] TestTimelineReaderWebServicesHBaseStorage fails
                 Key: YARN-10662
                 URL: https://issues.apache.org/jira/browse/YARN-10662
             Project: Hadoop YARN
          Issue Type: Bug
          Components: test
            Reporter: Akira Ajisaka


[https://ci-hadoop.apache.org/job/hadoop-qbt-trunk-java11-linux-x86_64/131/artifact/out/patch-unit-hadoop-yarn-project_hadoop-yarn_hadoop-yarn-server_hadoop-yarn-server-timelineservice-hbase-tests.txt]
{noformat}
[INFO] Running org.apache.hadoop.yarn.server.timelineservice.reader.TestTimelineReaderWebServicesHBaseStorage
[ERROR] Tests run: 1, Failures: 0, Errors: 1, Skipped: 0, Time elapsed: 1.515 s <<<
FAILURE! - in org.apache.hadoop.yarn.server.timelineservice.reader.TestTimelineReaderWebServicesHBaseStorage
[ERROR] org.apache.hadoop.yarn.server.timelineservice.reader.TestTimelineReaderWebServicesHBaseStorage 
Time elapsed: 1.514 s  <<< ERROR!
java.lang.ExceptionInInitializerError
	at org.apache.hadoop.yarn.server.timelineservice.reader.TestTimelineReaderWebServicesHBaseStorage.setupBeforeClass(TestTimelineReaderWebServicesHBaseStorage.java:84)
	at java.base/jdk.internal.reflect.NativeMethodAccessorImpl.invoke0(Native Method)
	at java.base/jdk.internal.reflect.NativeMethodAccessorImpl.invoke(NativeMethodAccessorImpl.java:62)
	at java.base/jdk.internal.reflect.DelegatingMethodAccessorImpl.invoke(DelegatingMethodAccessorImpl.java:43)
	at java.base/java.lang.reflect.Method.invoke(Method.java:566)
	at org.junit.runners.model.FrameworkMethod$1.runReflectiveCall(FrameworkMethod.java:50)
	at org.junit.internal.runners.model.ReflectiveCallable.run(ReflectiveCallable.java:12)
	at org.junit.runners.model.FrameworkMethod.invokeExplosively(FrameworkMethod.java:47)
	at org.junit.internal.runners.statements.RunBefores.evaluate(RunBefores.java:24)
	at org.junit.internal.runners.statements.RunAfters.evaluate(RunAfters.java:27)
	at org.junit.runners.ParentRunner.run(ParentRunner.java:363)
	at org.apache.maven.surefire.junit4.JUnit4Provider.execute(JUnit4Provider.java:365)
	at org.apache.maven.surefire.junit4.JUnit4Provider.executeWithRerun(JUnit4Provider.java:273)
	at org.apache.maven.surefire.junit4.JUnit4Provider.executeTestSet(JUnit4Provider.java:238)
	at org.apache.maven.surefire.junit4.JUnit4Provider.invoke(JUnit4Provider.java:159)
	at org.apache.maven.surefire.booter.ForkedBooter.invokeProviderInSameClassLoader(ForkedBooter.java:384)
	at org.apache.maven.surefire.booter.ForkedBooter.runSuitesInProcess(ForkedBooter.java:345)
	at org.apache.maven.surefire.booter.ForkedBooter.execute(ForkedBooter.java:126)
	at org.apache.maven.surefire.booter.ForkedBooter.main(ForkedBooter.java:418)
Caused by: java.lang.RuntimeException: java.io.IOException: Can not attach to current VM
	at mockit.internal.startup.AgentLoader.attachToRunningVM(AgentLoader.java:150)
	at mockit.internal.startup.AgentLoader.loadAgent(AgentLoader.java:60)
	at mockit.internal.startup.Startup.verifyInitialization(Startup.java:169)
	at mockit.MockUp.<clinit>(MockUp.java:94)
	... 19 more
Caused by: java.io.IOException: Can not attach to current VM
	at jdk.attach/sun.tools.attach.HotSpotVirtualMachine.<init>(HotSpotVirtualMachine.java:75)
	at jdk.attach/sun.tools.attach.VirtualMachineImpl.<init>(VirtualMachineImpl.java:56)
	at jdk.attach/sun.tools.attach.AttachProviderImpl.attachVirtualMachine(AttachProviderImpl.java:58)
	at jdk.attach/com.sun.tools.attach.VirtualMachine.attach(VirtualMachine.java:207)
	at mockit.internal.startup.AgentLoader.attachToRunningVM(AgentLoader.java:144)
	... 22 more


[INFO] 
[INFO] Results:
[INFO] 
[ERROR] Errors: 
[ERROR]   TestTimelineReaderWebServicesHBaseStorage.setupBeforeClass:84 ExceptionInInitializer
[INFO] 
[ERROR] Tests run: 1, Failures: 0, Errors: 1, Skipped: 0 {noformat}



--
This message was sent by Atlassian Jira
(v8.3.4#803005)

---------------------------------------------------------------------
To unsubscribe, e-mail: yarn-dev-unsubscribe@hadoop.apache.org
For additional commands, e-mail: yarn-dev-help@hadoop.apache.org


Mime
View raw message