ignite-dev mailing list archives

Site index · List index
Message view « Date » · « Thread »
Top « Date » · « Thread »
From "Kirill Gusakov (Jira)" <j...@apache.org>
Subject [jira] [Created] (IGNITE-14122) Fix NPE in ProgressBarTest
Date Wed, 03 Feb 2021 13:36:00 GMT
Kirill Gusakov created IGNITE-14122:
---------------------------------------

             Summary: Fix NPE in ProgressBarTest
                 Key: IGNITE-14122
                 URL: https://issues.apache.org/jira/browse/IGNITE-14122
             Project: Ignite
          Issue Type: Task
            Reporter: Kirill Gusakov
            Assignee: Kirill Gusakov


{noformat}
[ERROR] Tests run: 2, Failures: 2, Errors: 0, Skipped: 0, Time elapsed: 0.137 s <<<
FAILURE! - in org.apache.ignite.cli.ui.ProgressBarTest
[ERROR] org.apache.ignite.cli.ui.ProgressBarTest.testScaledToTerminalWidth()  Time elapsed:
0.134 s  <<< FAILURE!
java.lang.NullPointerException
	at org.apache.ignite.cli.ui.ProgressBar.step(ProgressBar.java:87)
	at org.apache.ignite.cli.ui.ProgressBarTest.testScaledToTerminalWidth(ProgressBarTest.java:55)[ERROR]
org.apache.ignite.cli.ui.ProgressBarTest.testRedundantStepsProgressBar()  Time elapsed: 0
s  <<< FAILURE!
java.lang.NullPointerException
	at org.apache.ignite.cli.ui.ProgressBar.step(ProgressBar.java:87)
	at org.apache.ignite.cli.ui.ProgressBarTest.testRedundantStepsProgressBar(ProgressBarTest.java:67){noformat}



--
This message was sent by Atlassian Jira
(v8.3.4#803005)

Mime
View raw message