jackrabbit-oak-issues mailing list archives

Site index · List index
Message view « Date » · « Thread »
Top « Date » · « Thread »
From "Marcel Reutegger (JIRA)" <j...@apache.org>
Subject [jira] [Updated] (OAK-3265) Test failures: NodeLocalNameTest, NodeNameTest
Date Wed, 02 Sep 2015 07:00:52 GMT

     [ https://issues.apache.org/jira/browse/OAK-3265?page=com.atlassian.jira.plugin.system.issuetabpanels:all-tabpanel
]

Marcel Reutegger updated OAK-3265:
----------------------------------
    Assignee: Thomas Mueller

[~tmueller], can you have a look at this? I think the tests fail because of OAK-2634.

> Test failures: NodeLocalNameTest, NodeNameTest
> ----------------------------------------------
>
>                 Key: OAK-3265
>                 URL: https://issues.apache.org/jira/browse/OAK-3265
>             Project: Jackrabbit Oak
>          Issue Type: Bug
>          Components: jcr
>    Affects Versions: 1.3.5, 1.0.20, 1.2.5
>            Reporter: Michael Dürig
>            Assignee: Thomas Mueller
>             Fix For: 1.3.6
>
>
> Trunk's it fail for me:
> {noformat}
> testStringLiteralInvalidName(org.apache.jackrabbit.test.api.query.qom.NodeLocalNameTest)
 Time elapsed: 0.007 sec  <<< ERROR!
> javax.jcr.query.InvalidQueryException: java.lang.IllegalArgumentException: Not a valid
JCR path: [node1
> 	at org.apache.jackrabbit.oak.jcr.query.QueryManagerImpl.executeQuery(QueryManagerImpl.java:142)
> 	at org.apache.jackrabbit.oak.jcr.query.qom.QueryObjectModelImpl.execute(QueryObjectModelImpl.java:131)
> 	at org.apache.jackrabbit.test.api.query.qom.NodeLocalNameTest.testStringLiteralInvalidName(NodeLocalNameTest.java:68)
> 	at sun.reflect.NativeMethodAccessorImpl.invoke0(Native Method)
> 	at sun.reflect.NativeMethodAccessorImpl.invoke(NativeMethodAccessorImpl.java:39)
> 	at sun.reflect.DelegatingMethodAccessorImpl.invoke(DelegatingMethodAccessorImpl.java:25)
> 	at java.lang.reflect.Method.invoke(Method.java:597)
> 	at junit.framework.TestCase.runTest(TestCase.java:168)
> 	at junit.framework.TestCase.runBare(TestCase.java:134)
> 	at junit.framework.TestResult$1.protect(TestResult.java:110)
> 	at junit.framework.TestResult.runProtected(TestResult.java:128)
> 	at junit.framework.TestResult.run(TestResult.java:113)
> 	at junit.framework.TestCase.run(TestCase.java:124)
> 	at org.apache.jackrabbit.test.AbstractJCRTest.run(AbstractJCRTest.java:464)
> 	at junit.framework.TestSuite.runTest(TestSuite.java:243)
> 	at junit.framework.TestSuite.run(TestSuite.java:238)
> 	at junit.framework.TestSuite.runTest(TestSuite.java:243)
> 	at junit.framework.TestSuite.run(TestSuite.java:238)
> 	at junit.framework.TestSuite.runTest(TestSuite.java:243)
> 	at junit.framework.TestSuite.run(TestSuite.java:238)
> 	at org.junit.internal.runners.JUnit38ClassRunner.run(JUnit38ClassRunner.java:83)
> 	at org.apache.maven.surefire.junit4.JUnit4Provider.execute(JUnit4Provider.java:252)
> 	at org.apache.maven.surefire.junit4.JUnit4Provider.executeTestSet(JUnit4Provider.java:141)
> 	at org.apache.maven.surefire.junit4.JUnit4Provider.invoke(JUnit4Provider.java:112)
> 	at sun.reflect.NativeMethodAccessorImpl.invoke0(Native Method)
> 	at sun.reflect.NativeMethodAccessorImpl.invoke(NativeMethodAccessorImpl.java:39)
> 	at sun.reflect.DelegatingMethodAccessorImpl.invoke(DelegatingMethodAccessorImpl.java:25)
> 	at java.lang.reflect.Method.invoke(Method.java:597)
> 	at org.apache.maven.surefire.util.ReflectionUtils.invokeMethodWithArray(ReflectionUtils.java:189)
> 	at org.apache.maven.surefire.booter.ProviderFactory$ProviderProxy.invoke(ProviderFactory.java:165)
> 	at org.apache.maven.surefire.booter.ProviderFactory.invokeProvider(ProviderFactory.java:85)
> 	at org.apache.maven.surefire.booter.ForkedBooter.runSuitesInProcess(ForkedBooter.java:115)
> 	at org.apache.maven.surefire.booter.ForkedBooter.main(ForkedBooter.java:75)
> Caused by: java.lang.IllegalArgumentException: Not a valid JCR path: [node1
> 	at org.apache.jackrabbit.oak.spi.query.PropertyValues.getOakPath(PropertyValues.java:405)
> 	at org.apache.jackrabbit.oak.query.ast.NodeNameImpl.getName(NodeNameImpl.java:131)
> 	at org.apache.jackrabbit.oak.query.ast.NodeLocalNameImpl.restrict(NodeLocalNameImpl.java:89)
> 	at org.apache.jackrabbit.oak.query.ast.ComparisonImpl.restrict(ComparisonImpl.java:184)
> 	at org.apache.jackrabbit.oak.query.ast.AndImpl.restrict(AndImpl.java:153)
> 	at org.apache.jackrabbit.oak.query.ast.SelectorImpl.createFilter(SelectorImpl.java:389)
> 	at org.apache.jackrabbit.oak.query.ast.SelectorImpl.prepare(SelectorImpl.java:284)
> 	at org.apache.jackrabbit.oak.query.QueryImpl.prepare(QueryImpl.java:591)
> 	at org.apache.jackrabbit.oak.query.QueryEngineImpl.executeQuery(QueryEngineImpl.java:193)
> 	at org.apache.jackrabbit.oak.jcr.query.QueryManagerImpl.executeQuery(QueryManagerImpl.java:132)
> 	... 32 more
> testURILiteral(org.apache.jackrabbit.test.api.query.qom.NodeLocalNameTest)  Time elapsed:
0.005 sec  <<< ERROR!
> javax.jcr.query.InvalidQueryException: java.lang.IllegalArgumentException: Not a valid
JCR path: http://example.com
> 	at org.apache.jackrabbit.oak.jcr.query.QueryManagerImpl.executeQuery(QueryManagerImpl.java:142)
> 	at org.apache.jackrabbit.oak.jcr.query.qom.QueryObjectModelImpl.execute(QueryObjectModelImpl.java:131)
> 	at org.apache.jackrabbit.test.api.query.qom.AbstractQOMTest.checkQOM(AbstractQOMTest.java:112)
> 	at org.apache.jackrabbit.test.api.query.qom.NodeLocalNameTest.testURILiteral(NodeLocalNameTest.java:153)
> 	at sun.reflect.NativeMethodAccessorImpl.invoke0(Native Method)
> 	at sun.reflect.NativeMethodAccessorImpl.invoke(NativeMethodAccessorImpl.java:39)
> 	at sun.reflect.DelegatingMethodAccessorImpl.invoke(DelegatingMethodAccessorImpl.java:25)
> 	at java.lang.reflect.Method.invoke(Method.java:597)
> 	at junit.framework.TestCase.runTest(TestCase.java:168)
> 	at junit.framework.TestCase.runBare(TestCase.java:134)
> 	at junit.framework.TestResult$1.protect(TestResult.java:110)
> 	at junit.framework.TestResult.runProtected(TestResult.java:128)
> 	at junit.framework.TestResult.run(TestResult.java:113)
> 	at junit.framework.TestCase.run(TestCase.java:124)
> 	at org.apache.jackrabbit.test.AbstractJCRTest.run(AbstractJCRTest.java:464)
> 	at junit.framework.TestSuite.runTest(TestSuite.java:243)
> 	at junit.framework.TestSuite.run(TestSuite.java:238)
> 	at junit.framework.TestSuite.runTest(TestSuite.java:243)
> 	at junit.framework.TestSuite.run(TestSuite.java:238)
> 	at junit.framework.TestSuite.runTest(TestSuite.java:243)
> 	at junit.framework.TestSuite.run(TestSuite.java:238)
> 	at org.junit.internal.runners.JUnit38ClassRunner.run(JUnit38ClassRunner.java:83)
> 	at org.apache.maven.surefire.junit4.JUnit4Provider.execute(JUnit4Provider.java:252)
> 	at org.apache.maven.surefire.junit4.JUnit4Provider.executeTestSet(JUnit4Provider.java:141)
> 	at org.apache.maven.surefire.junit4.JUnit4Provider.invoke(JUnit4Provider.java:112)
> 	at sun.reflect.NativeMethodAccessorImpl.invoke0(Native Method)
> 	at sun.reflect.NativeMethodAccessorImpl.invoke(NativeMethodAccessorImpl.java:39)
> 	at sun.reflect.DelegatingMethodAccessorImpl.invoke(DelegatingMethodAccessorImpl.java:25)
> 	at java.lang.reflect.Method.invoke(Method.java:597)
> 	at org.apache.maven.surefire.util.ReflectionUtils.invokeMethodWithArray(ReflectionUtils.java:189)
> 	at org.apache.maven.surefire.booter.ProviderFactory$ProviderProxy.invoke(ProviderFactory.java:165)
> 	at org.apache.maven.surefire.booter.ProviderFactory.invokeProvider(ProviderFactory.java:85)
> 	at org.apache.maven.surefire.booter.ForkedBooter.runSuitesInProcess(ForkedBooter.java:115)
> 	at org.apache.maven.surefire.booter.ForkedBooter.main(ForkedBooter.java:75)
> Caused by: java.lang.IllegalArgumentException: Not a valid JCR path: http://example.com
> 	at org.apache.jackrabbit.oak.spi.query.PropertyValues.getOakPath(PropertyValues.java:405)
> 	at org.apache.jackrabbit.oak.query.ast.NodeNameImpl.getName(NodeNameImpl.java:131)
> 	at org.apache.jackrabbit.oak.query.ast.NodeLocalNameImpl.restrict(NodeLocalNameImpl.java:89)
> 	at org.apache.jackrabbit.oak.query.ast.ComparisonImpl.restrict(ComparisonImpl.java:184)
> 	at org.apache.jackrabbit.oak.query.ast.AndImpl.restrict(AndImpl.java:153)
> 	at org.apache.jackrabbit.oak.query.ast.SelectorImpl.createFilter(SelectorImpl.java:389)
> 	at org.apache.jackrabbit.oak.query.ast.SelectorImpl.prepare(SelectorImpl.java:284)
> 	at org.apache.jackrabbit.oak.query.QueryImpl.prepare(QueryImpl.java:591)
> 	at org.apache.jackrabbit.oak.query.QueryEngineImpl.executeQuery(QueryEngineImpl.java:193)
> 	at org.apache.jackrabbit.oak.jcr.query.QueryManagerImpl.executeQuery(QueryManagerImpl.java:132)
> 	... 33 more
> testPathLiteral(org.apache.jackrabbit.test.api.query.qom.NodeNameTest)  Time elapsed:
0.005 sec  <<< FAILURE!
> junit.framework.AssertionFailedError: NodeName comparison with absolute PATH must fail
with InvalidQueryException
> 	at junit.framework.Assert.fail(Assert.java:50)
> 	at org.apache.jackrabbit.test.api.query.qom.NodeNameTest.testPathLiteral(NodeNameTest.java:187)
> 	at sun.reflect.NativeMethodAccessorImpl.invoke0(Native Method)
> 	at sun.reflect.NativeMethodAccessorImpl.invoke(NativeMethodAccessorImpl.java:39)
> 	at sun.reflect.DelegatingMethodAccessorImpl.invoke(DelegatingMethodAccessorImpl.java:25)
> 	at java.lang.reflect.Method.invoke(Method.java:597)
> 	at junit.framework.TestCase.runTest(TestCase.java:168)
> 	at junit.framework.TestCase.runBare(TestCase.java:134)
> 	at junit.framework.TestResult$1.protect(TestResult.java:110)
> 	at junit.framework.TestResult.runProtected(TestResult.java:128)
> 	at junit.framework.TestResult.run(TestResult.java:113)
> 	at junit.framework.TestCase.run(TestCase.java:124)
> 	at org.apache.jackrabbit.test.AbstractJCRTest.run(AbstractJCRTest.java:464)
> 	at junit.framework.TestSuite.runTest(TestSuite.java:243)
> 	at junit.framework.TestSuite.run(TestSuite.java:238)
> 	at junit.framework.TestSuite.runTest(TestSuite.java:243)
> 	at junit.framework.TestSuite.run(TestSuite.java:238)
> 	at junit.framework.TestSuite.runTest(TestSuite.java:243)
> 	at junit.framework.TestSuite.run(TestSuite.java:238)
> 	at org.junit.internal.runners.JUnit38ClassRunner.run(JUnit38ClassRunner.java:83)
> 	at org.apache.maven.surefire.junit4.JUnit4Provider.execute(JUnit4Provider.java:252)
> 	at org.apache.maven.surefire.junit4.JUnit4Provider.executeTestSet(JUnit4Provider.java:141)
> 	at org.apache.maven.surefire.junit4.JUnit4Provider.invoke(JUnit4Provider.java:112)
> 	at sun.reflect.NativeMethodAccessorImpl.invoke0(Native Method)
> 	at sun.reflect.NativeMethodAccessorImpl.invoke(NativeMethodAccessorImpl.java:39)
> 	at sun.reflect.DelegatingMethodAccessorImpl.invoke(DelegatingMethodAccessorImpl.java:25)
> 	at java.lang.reflect.Method.invoke(Method.java:597)
> 	at org.apache.maven.surefire.util.ReflectionUtils.invokeMethodWithArray(ReflectionUtils.java:189)
> 	at org.apache.maven.surefire.booter.ProviderFactory$ProviderProxy.invoke(ProviderFactory.java:165)
> 	at org.apache.maven.surefire.booter.ProviderFactory.invokeProvider(ProviderFactory.java:85)
> 	at org.apache.maven.surefire.booter.ForkedBooter.runSuitesInProcess(ForkedBooter.java:115)
> 	at org.apache.maven.surefire.booter.ForkedBooter.main(ForkedBooter.java:75)
> {noformat}



--
This message was sent by Atlassian JIRA
(v6.3.4#6332)

Mime
View raw message