jackrabbit-oak-issues mailing list archives

Site index · List index
Message view « Date » · « Thread »
Top « Date » · « Thread »
From "Chetan Mehrotra (JIRA)" <j...@apache.org>
Subject [jira] [Created] (OAK-4132) JaasConfigSpiTest fails intermittently with missing LoginModule exception
Date Fri, 18 Mar 2016 06:15:33 GMT
Chetan Mehrotra created OAK-4132:
------------------------------------

             Summary: JaasConfigSpiTest fails intermittently with missing LoginModule exception
                 Key: OAK-4132
                 URL: https://issues.apache.org/jira/browse/OAK-4132
             Project: Jackrabbit Oak
          Issue Type: Task
          Components: pojosr
            Reporter: Chetan Mehrotra
            Assignee: Chetan Mehrotra
            Priority: Minor
             Fix For: 1.6
         Attachments: ci-stdout.txt

Following failure is seen on some CI

{noformat}
Running org.apache.jackrabbit.oak.run.osgi.JaasConfigSpiTest
Tests run: 1, Failures: 0, Errors: 1, Skipped: 0, Time elapsed: 0.98 sec <<< FAILURE!
defaultConfigSpiAuth(org.apache.jackrabbit.oak.run.osgi.JaasConfigSpiTest)  Time elapsed:
0.97 sec  <<< ERROR!
java.lang.reflect.UndeclaredThrowableException
	at com.sun.proxy.$Proxy16.login(Unknown Source)
	at javax.jcr.Repository$login.call(Unknown Source)
	at org.codehaus.groovy.runtime.callsite.CallSiteArray.defaultCall(CallSiteArray.java:45)
	at org.codehaus.groovy.runtime.callsite.AbstractCallSite.call(AbstractCallSite.java:108)
	at org.codehaus.groovy.runtime.callsite.AbstractCallSite.call(AbstractCallSite.java:116)
	at org.apache.jackrabbit.oak.run.osgi.JaasConfigSpiTest.defaultConfigSpiAuth(JaasConfigSpiTest.groovy:78)
	at sun.reflect.NativeMethodAccessorImpl.invoke0(Native Method)
	at sun.reflect.NativeMethodAccessorImpl.invoke(NativeMethodAccessorImpl.java:57)
	at sun.reflect.DelegatingMethodAccessorImpl.invoke(DelegatingMethodAccessorImpl.java:43)
	at java.lang.reflect.Method.invoke(Method.java:606)
	at org.junit.runners.model.FrameworkMethod$1.runReflectiveCall(FrameworkMethod.java:50)
	at org.junit.internal.runners.model.ReflectiveCallable.run(ReflectiveCallable.java:12)
	at org.junit.runners.model.FrameworkMethod.invokeExplosively(FrameworkMethod.java:47)
	at org.junit.internal.runners.statements.InvokeMethod.evaluate(InvokeMethod.java:17)
	at org.junit.internal.runners.statements.RunBefores.evaluate(RunBefores.java:26)
	at org.junit.internal.runners.statements.RunAfters.evaluate(RunAfters.java:27)
	at org.junit.rules.ExternalResource$1.evaluate(ExternalResource.java:48)
	at org.junit.rules.RunRules.evaluate(RunRules.java:20)
	at org.junit.runners.ParentRunner.runLeaf(ParentRunner.java:325)
	at org.junit.runners.BlockJUnit4ClassRunner.runChild(BlockJUnit4ClassRunner.java:78)
	at org.junit.runners.BlockJUnit4ClassRunner.runChild(BlockJUnit4ClassRunner.java:57)
	at org.junit.runners.ParentRunner$3.run(ParentRunner.java:290)
	at org.junit.runners.ParentRunner$1.schedule(ParentRunner.java:71)
	at org.junit.runners.ParentRunner.runChildren(ParentRunner.java:288)
	at org.junit.runners.ParentRunner.access$000(ParentRunner.java:58)
	at org.junit.runners.ParentRunner$2.evaluate(ParentRunner.java:268)
	at org.junit.runners.ParentRunner.run(ParentRunner.java:363)
	at org.apache.maven.surefire.junit4.JUnit4Provider.execute(JUnit4Provider.java:252)
	at org.apache.maven.surefire.junit4.JUnit4Provider.executeTestSet(JUnit4Provider.java:141)
	at org.apache.maven.surefire.junit4.JUnit4Provider.invoke(JUnit4Provider.java:112)
	at sun.reflect.NativeMethodAccessorImpl.invoke0(Native Method)
	at sun.reflect.NativeMethodAccessorImpl.invoke(NativeMethodAccessorImpl.java:57)
	at sun.reflect.DelegatingMethodAccessorImpl.invoke(DelegatingMethodAccessorImpl.java:43)
	at java.lang.reflect.Method.invoke(Method.java:606)
	at org.apache.maven.surefire.util.ReflectionUtils.invokeMethodWithArray(ReflectionUtils.java:189)
	at org.apache.maven.surefire.booter.ProviderFactory$ProviderProxy.invoke(ProviderFactory.java:165)
	at org.apache.maven.surefire.booter.ProviderFactory.invokeProvider(ProviderFactory.java:85)
	at org.apache.maven.surefire.booter.ForkedBooter.runSuitesInProcess(ForkedBooter.java:115)
	at org.apache.maven.surefire.booter.ForkedBooter.main(ForkedBooter.java:75)
Caused by: java.lang.reflect.InvocationTargetException
	at sun.reflect.NativeMethodAccessorImpl.invoke0(Native Method)
	at sun.reflect.NativeMethodAccessorImpl.invoke(NativeMethodAccessorImpl.java:57)
	at sun.reflect.DelegatingMethodAccessorImpl.invoke(DelegatingMethodAccessorImpl.java:43)
	at java.lang.reflect.Method.invoke(Method.java:606)
	at org.apache.jackrabbit.oak.run.osgi.OakOSGiRepositoryFactory$RepositoryProxy.invoke(OakOSGiRepositoryFactory.java:485)
	... 39 more
Caused by: javax.jcr.LoginException: No LoginModules configured for jackrabbit.oak
	at org.apache.jackrabbit.oak.jcr.repository.RepositoryImpl.login(RepositoryImpl.java:288)
	at org.apache.jackrabbit.oak.jcr.repository.RepositoryImpl.login(RepositoryImpl.java:244)
	... 44 more
Caused by: javax.security.auth.login.LoginException: No LoginModules configured for jackrabbit.oak
	at javax.security.auth.login.LoginContext.init(LoginContext.java:272)
	at javax.security.auth.login.LoginContext.<init>(LoginContext.java:520)
	at org.apache.jackrabbit.oak.spi.security.authentication.JaasLoginContext.<init>(JaasLoginContext.java:49)
	at org.apache.jackrabbit.oak.security.authentication.LoginContextProviderImpl.getLoginContext(LoginContextProviderImpl.java:85)
	at org.apache.jackrabbit.oak.core.ContentRepositoryImpl.login(ContentRepositoryImpl.java:164)
	at org.apache.jackrabbit.oak.jcr.repository.RepositoryImpl.login(RepositoryImpl.java:280)
	... 45 more
{noformat}



--
This message was sent by Atlassian JIRA
(v6.3.4#6332)

Mime
View raw message