jackrabbit-oak-issues mailing list archives

Site index · List index
Message view « Date » · « Thread »
Top « Date » · « Thread »
From "Davide Giannella (JIRA)" <j...@apache.org>
Subject [jira] [Closed] (OAK-4963) Test failure: SegmentDataStoreBlobGCIT
Date Mon, 14 Nov 2016 11:36:02 GMT

     [ https://issues.apache.org/jira/browse/OAK-4963?page=com.atlassian.jira.plugin.system.issuetabpanels:all-tabpanel
]

Davide Giannella closed OAK-4963.
---------------------------------

Bulk close for 1.5.13

> Test failure: SegmentDataStoreBlobGCIT
> --------------------------------------
>
>                 Key: OAK-4963
>                 URL: https://issues.apache.org/jira/browse/OAK-4963
>             Project: Jackrabbit Oak
>          Issue Type: Bug
>          Components: segment-tar
>            Reporter: Francesco Mari
>            Assignee: Francesco Mari
>              Labels: test-failure
>             Fix For: 1.6, 1.5.13
>
>
> SegmentDataStoreBlobGCIT seems to crash the JVM on Java 7. Following is the relevant
part of the build output.
> {noformat}
> [INFO] --- maven-failsafe-plugin:2.19.1:integration-test (default) @ oak-segment-tar
---
> -------------------------------------------------------
>  T E S T S
> -------------------------------------------------------
> Running org.apache.jackrabbit.oak.segment.file.FileStoreIT
> Tests run: 7, Failures: 0, Errors: 0, Skipped: 0, Time elapsed: 22.301 sec - in org.apache.jackrabbit.oak.segment.file.FileStoreIT
> Running org.apache.jackrabbit.oak.segment.file.SegmentReferenceLimitTestIT
> Tests run: 1, Failures: 0, Errors: 0, Skipped: 1, Time elapsed: 0 sec - in org.apache.jackrabbit.oak.segment.file.SegmentReferenceLimitTestIT
> Running org.apache.jackrabbit.oak.segment.file.LargeNumberOfPropertiesTestIT
> Tests run: 1, Failures: 0, Errors: 0, Skipped: 1, Time elapsed: 0.001 sec - in org.apache.jackrabbit.oak.segment.file.LargeNumberOfPropertiesTestIT
> Running org.apache.jackrabbit.oak.segment.SegmentOverflowExceptionIT
> Tests run: 1, Failures: 0, Errors: 0, Skipped: 1, Time elapsed: 0 sec - in org.apache.jackrabbit.oak.segment.SegmentOverflowExceptionIT
> Running org.apache.jackrabbit.oak.segment.standby.ExternalPrivateStoreIT
> Tests run: 8, Failures: 0, Errors: 0, Skipped: 0, Time elapsed: 45.78 sec - in org.apache.jackrabbit.oak.segment.standby.ExternalPrivateStoreIT
> Running org.apache.jackrabbit.oak.segment.standby.FailoverSslTestIT
> Tests run: 3, Failures: 0, Errors: 0, Skipped: 0, Time elapsed: 9.202 sec - in org.apache.jackrabbit.oak.segment.standby.FailoverSslTestIT
> Running org.apache.jackrabbit.oak.segment.standby.BrokenNetworkIT
> Tests run: 12, Failures: 0, Errors: 0, Skipped: 0, Time elapsed: 63.024 sec - in org.apache.jackrabbit.oak.segment.standby.BrokenNetworkIT
> Running org.apache.jackrabbit.oak.segment.standby.FailoverMultipleClientsTestIT
> Tests run: 1, Failures: 0, Errors: 0, Skipped: 0, Time elapsed: 10.052 sec - in org.apache.jackrabbit.oak.segment.standby.FailoverMultipleClientsTestIT
> Running org.apache.jackrabbit.oak.segment.standby.MBeanIT
> Tests run: 4, Failures: 0, Errors: 0, Skipped: 0, Time elapsed: 9.287 sec - in org.apache.jackrabbit.oak.segment.standby.MBeanIT
> Running org.apache.jackrabbit.oak.segment.standby.FailoverIPRangeIT
> Tests run: 16, Failures: 0, Errors: 0, Skipped: 0, Time elapsed: 42.691 sec - in org.apache.jackrabbit.oak.segment.standby.FailoverIPRangeIT
> Running org.apache.jackrabbit.oak.segment.standby.StandbyTestIT
> Tests run: 2, Failures: 0, Errors: 0, Skipped: 0, Time elapsed: 23.303 sec - in org.apache.jackrabbit.oak.segment.standby.StandbyTestIT
> Running org.apache.jackrabbit.oak.segment.standby.RecoverTestIT
> Tests run: 1, Failures: 0, Errors: 0, Skipped: 0, Time elapsed: 2.415 sec - in org.apache.jackrabbit.oak.segment.standby.RecoverTestIT
> Running org.apache.jackrabbit.oak.segment.standby.ExternalSharedStoreIT
> Tests run: 8, Failures: 0, Errors: 0, Skipped: 0, Time elapsed: 39.002 sec - in org.apache.jackrabbit.oak.segment.standby.ExternalSharedStoreIT
> Running org.apache.jackrabbit.oak.segment.SegmentDataStoreBlobGCIT
> Results :
> Tests run: 65, Failures: 0, Errors: 0, Skipped: 3
> [INFO] ------------------------------------------------------------------------
> [INFO] BUILD FAILURE
> [INFO] ------------------------------------------------------------------------
> [INFO] Total time: 10:17 min
> [INFO] Finished at: 2016-10-19T20:45:40+00:00
> [INFO] Final Memory: 63M/553M
> [INFO] ------------------------------------------------------------------------
> [ERROR] Failed to execute goal org.apache.maven.plugins:maven-failsafe-plugin:2.19.1:integration-test
(default) on project oak-segment-tar: Execution default of goal org.apache.maven.plugins:maven-failsafe-plugin:2.19.1:integration-test
failed: The forked VM terminated without properly saying goodbye. VM crash or System.exit
called?
> [ERROR] Command was /bin/sh -c cd /apps/jenkins/workspace/oak-segment-tar &&
/opt/jdk-7/jre/bin/java -Xmx512m -XX:MaxPermSize=64m -XX:+HeapDumpOnOutOfMemoryError -Dupdate.limit=100
-Djava.awt.headless=true -jar /apps/jenkins/workspace/oak-segment-tar/target/surefire/surefirebooter4283069132546797078.jar
/apps/jenkins/workspace/oak-segment-tar/target/surefire/surefire8963659563100379656tmp /apps/jenkins/workspace/oak-segment-tar/target/surefire/surefire_03767892930481742588tmp
> {noformat}



--
This message was sent by Atlassian JIRA
(v6.3.4#6332)

Mime
View raw message