jackrabbit-oak-issues mailing list archives

Site index · List index
Message view « Date » · « Thread »
Top « Date » · « Thread »
From Michael Dürig (JIRA) <j...@apache.org>
Subject [jira] [Updated] (OAK-5387) Test failure: ConcurrentQueryAndUpdateIT.cacheUpdate[RDBFixture: RDB-H2(file)]
Date Tue, 14 Feb 2017 08:09:41 GMT

     [ https://issues.apache.org/jira/browse/OAK-5387?page=com.atlassian.jira.plugin.system.issuetabpanels:all-tabpanel
]

Michael Dürig updated OAK-5387:
-------------------------------
    Description: 
Jenkins CI failure: https://builds.apache.org/job/Apache%20Jackrabbit%20Oak%20matrix/

The build Apache Jackrabbit Oak matrix/Ubuntu Slaves=ubuntu,jdk=JDK 1.8 (latest),nsfixtures=DOCUMENT_RDB,profile=integrationTesting
#1345 has failed.
First failed run: [Apache Jackrabbit Oak matrix/Ubuntu Slaves=ubuntu,jdk=JDK 1.8 (latest),nsfixtures=DOCUMENT_RDB,profile=integrationTesting
#1345|https://builds.apache.org/job/Apache%20Jackrabbit%20Oak%20matrix/Ubuntu%20Slaves=ubuntu,jdk=JDK%201.8%20(latest),nsfixtures=DOCUMENT_RDB,profile=integrationTesting/1345/]
[console log|https://builds.apache.org/job/Apache%20Jackrabbit%20Oak%20matrix/Ubuntu%20Slaves=ubuntu,jdk=JDK%201.8%20(latest),nsfixtures=DOCUMENT_RDB,profile=integrationTesting/1345/console]

{noformat}
cacheUpdate[RDBFixture: RDB-H2(file)](org.apache.jackrabbit.oak.plugins.document.ConcurrentQueryAndUpdateIT)
 Time elapsed: 54.353 sec  <<< FAILURE!
java.lang.AssertionError: Unexpected revision timestamp for 1:/node-39 expected:<867>
but was:<866>
	at org.junit.Assert.fail(Assert.java:88)
	at org.junit.Assert.failNotEquals(Assert.java:834)
	at org.junit.Assert.assertEquals(Assert.java:645)
	at org.apache.jackrabbit.oak.plugins.document.ConcurrentQueryAndUpdateIT.cacheUpdate(ConcurrentQueryAndUpdateIT.java:80)

Failed tests:   cacheUpdate[RDBFixture: RDB-H2(file)](org.apache.jackrabbit.oak.plugins.document.ConcurrentQueryAndUpdateIT):
Unexpected revision timestamp for 1:/node-39 expected:<867> but was:<866>
{noformat}

Also seen on Windows: https://builds.apache.org/job/Oak-Win/Windows%20slaves=Windows,jdk=JDK%201.8%20(unlimited%20security)%2064-bit%20Windows%20only,nsfixtures=DOCUMENT_NS,profile=integrationTesting/448/

  was:
Jenkins CI failure: https://builds.apache.org/job/Apache%20Jackrabbit%20Oak%20matrix/

The build Apache Jackrabbit Oak matrix/Ubuntu Slaves=ubuntu,jdk=JDK 1.8 (latest),nsfixtures=DOCUMENT_RDB,profile=integrationTesting
#1345 has failed.
First failed run: [Apache Jackrabbit Oak matrix/Ubuntu Slaves=ubuntu,jdk=JDK 1.8 (latest),nsfixtures=DOCUMENT_RDB,profile=integrationTesting
#1345|https://builds.apache.org/job/Apache%20Jackrabbit%20Oak%20matrix/Ubuntu%20Slaves=ubuntu,jdk=JDK%201.8%20(latest),nsfixtures=DOCUMENT_RDB,profile=integrationTesting/1345/]
[console log|https://builds.apache.org/job/Apache%20Jackrabbit%20Oak%20matrix/Ubuntu%20Slaves=ubuntu,jdk=JDK%201.8%20(latest),nsfixtures=DOCUMENT_RDB,profile=integrationTesting/1345/console]

{noformat}
cacheUpdate[RDBFixture: RDB-H2(file)](org.apache.jackrabbit.oak.plugins.document.ConcurrentQueryAndUpdateIT)
 Time elapsed: 54.353 sec  <<< FAILURE!
java.lang.AssertionError: Unexpected revision timestamp for 1:/node-39 expected:<867>
but was:<866>
	at org.junit.Assert.fail(Assert.java:88)
	at org.junit.Assert.failNotEquals(Assert.java:834)
	at org.junit.Assert.assertEquals(Assert.java:645)
	at org.apache.jackrabbit.oak.plugins.document.ConcurrentQueryAndUpdateIT.cacheUpdate(ConcurrentQueryAndUpdateIT.java:80)

Failed tests:   cacheUpdate[RDBFixture: RDB-H2(file)](org.apache.jackrabbit.oak.plugins.document.ConcurrentQueryAndUpdateIT):
Unexpected revision timestamp for 1:/node-39 expected:<867> but was:<866>
{noformat}




> Test failure: ConcurrentQueryAndUpdateIT.cacheUpdate[RDBFixture: RDB-H2(file)]
> ------------------------------------------------------------------------------
>
>                 Key: OAK-5387
>                 URL: https://issues.apache.org/jira/browse/OAK-5387
>             Project: Jackrabbit Oak
>          Issue Type: Bug
>          Components: continuous integration, rdbmk
>            Reporter: Hudson
>            Assignee: Julian Reschke
>              Labels: Windows, test-failure
>             Fix For: 1.8
>
>         Attachments: unit-tests.log.zip
>
>
> Jenkins CI failure: https://builds.apache.org/job/Apache%20Jackrabbit%20Oak%20matrix/
> The build Apache Jackrabbit Oak matrix/Ubuntu Slaves=ubuntu,jdk=JDK 1.8 (latest),nsfixtures=DOCUMENT_RDB,profile=integrationTesting
#1345 has failed.
> First failed run: [Apache Jackrabbit Oak matrix/Ubuntu Slaves=ubuntu,jdk=JDK 1.8 (latest),nsfixtures=DOCUMENT_RDB,profile=integrationTesting
#1345|https://builds.apache.org/job/Apache%20Jackrabbit%20Oak%20matrix/Ubuntu%20Slaves=ubuntu,jdk=JDK%201.8%20(latest),nsfixtures=DOCUMENT_RDB,profile=integrationTesting/1345/]
[console log|https://builds.apache.org/job/Apache%20Jackrabbit%20Oak%20matrix/Ubuntu%20Slaves=ubuntu,jdk=JDK%201.8%20(latest),nsfixtures=DOCUMENT_RDB,profile=integrationTesting/1345/console]
> {noformat}
> cacheUpdate[RDBFixture: RDB-H2(file)](org.apache.jackrabbit.oak.plugins.document.ConcurrentQueryAndUpdateIT)
 Time elapsed: 54.353 sec  <<< FAILURE!
> java.lang.AssertionError: Unexpected revision timestamp for 1:/node-39 expected:<867>
but was:<866>
> 	at org.junit.Assert.fail(Assert.java:88)
> 	at org.junit.Assert.failNotEquals(Assert.java:834)
> 	at org.junit.Assert.assertEquals(Assert.java:645)
> 	at org.apache.jackrabbit.oak.plugins.document.ConcurrentQueryAndUpdateIT.cacheUpdate(ConcurrentQueryAndUpdateIT.java:80)
> Failed tests:   cacheUpdate[RDBFixture: RDB-H2(file)](org.apache.jackrabbit.oak.plugins.document.ConcurrentQueryAndUpdateIT):
Unexpected revision timestamp for 1:/node-39 expected:<867> but was:<866>
> {noformat}
> Also seen on Windows: https://builds.apache.org/job/Oak-Win/Windows%20slaves=Windows,jdk=JDK%201.8%20(unlimited%20security)%2064-bit%20Windows%20only,nsfixtures=DOCUMENT_NS,profile=integrationTesting/448/



--
This message was sent by Atlassian JIRA
(v6.3.15#6346)

Mime
View raw message