jackrabbit-oak-issues mailing list archives

Site index · List index
Message view « Date » · « Thread »
Top « Date » · « Thread »
From Michael Dürig (JIRA) <j...@apache.org>
Subject [jira] [Commented] (OAK-5568) Test failure: ExternalSharedStoreIT
Date Thu, 02 Feb 2017 08:18:51 GMT

    [ https://issues.apache.org/jira/browse/OAK-5568?page=com.atlassian.jira.plugin.system.issuetabpanels:comment-tabpanel&focusedCommentId=15849634#comment-15849634
] 

Michael Dürig commented on OAK-5568:
------------------------------------

{noformat}
Running org.apache.jackrabbit.oak.plugins.segment.standby.ExternalSharedStoreIT
java.net.ConnectException: Connection refused: /127.0.0.1:52800
	at sun.nio.ch.SocketChannelImpl.checkConnect(Native Method)
	at sun.nio.ch.SocketChannelImpl.finishConnect(SocketChannelImpl.java:744)
	at io.netty.channel.socket.nio.NioSocketChannel.doFinishConnect(NioSocketChannel.java:208)
	at io.netty.channel.nio.AbstractNioChannel$AbstractNioUnsafe.finishConnect(AbstractNioChannel.java:287)
	at io.netty.channel.nio.NioEventLoop.processSelectedKey(NioEventLoop.java:528)
	at io.netty.channel.nio.NioEventLoop.processSelectedKeysOptimized(NioEventLoop.java:468)
	at io.netty.channel.nio.NioEventLoop.processSelectedKeys(NioEventLoop.java:382)
	at io.netty.channel.nio.NioEventLoop.run(NioEventLoop.java:354)
	at io.netty.util.concurrent.SingleThreadEventExecutor$2.run(SingleThreadEventExecutor.java:116)
	at io.netty.util.concurrent.DefaultThreadFactory$DefaultRunnableDecorator.run(DefaultThreadFactory.java:137)
	at java.lang.Thread.run(Thread.java:745)
java.lang.NullPointerException
	at org.apache.jackrabbit.oak.plugins.segment.ForwardHandler.channelUnregistered(NetworkErrorProxy.java:150)
	at io.netty.channel.AbstractChannelHandlerContext.invokeChannelUnregistered(AbstractChannelHandlerContext.java:183)
	at io.netty.channel.AbstractChannelHandlerContext.fireChannelUnregistered(AbstractChannelHandlerContext.java:169)
	at io.netty.channel.DefaultChannelPipeline.fireChannelUnregistered(DefaultChannelPipeline.java:738)
	at io.netty.channel.AbstractChannel$AbstractUnsafe$6.run(AbstractChannel.java:606)
	at io.netty.util.concurrent.SingleThreadEventExecutor.runAllTasks(SingleThreadEventExecutor.java:380)
	at io.netty.channel.nio.NioEventLoop.run(NioEventLoop.java:357)
	at io.netty.util.concurrent.SingleThreadEventExecutor$2.run(SingleThreadEventExecutor.java:116)
	at io.netty.util.concurrent.DefaultThreadFactory$DefaultRunnableDecorator.run(DefaultThreadFactory.java:137)
	at java.lang.Thread.run(Thread.java:745)
Tests run: 8, Failures: 2, Errors: 4, Skipped: 0, Time elapsed: 78.903 sec <<< FAILURE!
testProxySkippedBytes(org.apache.jackrabbit.oak.plugins.segment.standby.ExternalSharedStoreIT)
 Time elapsed: 4.7 sec  <<< ERROR!
java.lang.Exception: proxy not started
	at org.apache.jackrabbit.oak.plugins.segment.NetworkErrorProxy.reset(NetworkErrorProxy.java:87)
	at org.apache.jackrabbit.oak.plugins.segment.standby.DataStoreTestBase.useProxy(DataStoreTestBase.java:176)
	at org.apache.jackrabbit.oak.plugins.segment.standby.DataStoreTestBase.testProxySkippedBytes(DataStoreTestBase.java:118)
{noformat}


> Test failure: ExternalSharedStoreIT
> -----------------------------------
>
>                 Key: OAK-5568
>                 URL: https://issues.apache.org/jira/browse/OAK-5568
>             Project: Jackrabbit Oak
>          Issue Type: Bug
>          Components: continuous integration
>            Reporter: Hudson
>              Labels: test-failure
>             Fix For: 1.0.37
>
>
> Jenkins CI failure: https://builds.apache.org/job/Apache%20Jackrabbit%20Oak%20matrix/
> The build Apache Jackrabbit Oak matrix/Ubuntu Slaves=ubuntu,jdk=JDK 1.7 (latest),nsfixtures=DOCUMENT_NS,profile=integrationTesting
#1398 has failed.
> First failed run: [Apache Jackrabbit Oak matrix/Ubuntu Slaves=ubuntu,jdk=JDK 1.7 (latest),nsfixtures=DOCUMENT_NS,profile=integrationTesting
#1398|https://builds.apache.org/job/Apache%20Jackrabbit%20Oak%20matrix/Ubuntu%20Slaves=ubuntu,jdk=JDK%201.7%20(latest),nsfixtures=DOCUMENT_NS,profile=integrationTesting/1398/]
[console log|https://builds.apache.org/job/Apache%20Jackrabbit%20Oak%20matrix/Ubuntu%20Slaves=ubuntu,jdk=JDK%201.7%20(latest),nsfixtures=DOCUMENT_NS,profile=integrationTesting/1398/console]



--
This message was sent by Atlassian JIRA
(v6.3.15#6346)

Mime
View raw message