jackrabbit-oak-issues mailing list archives

Site index · List index
Message view « Date » · « Thread »
Top « Date » · « Thread »
From Michael Dürig (JIRA) <j...@apache.org>
Subject [jira] [Updated] (OAK-5618) Jenkins: checksum mismatch after transfer
Date Mon, 13 Feb 2017 08:56:42 GMT

     [ https://issues.apache.org/jira/browse/OAK-5618?page=com.atlassian.jira.plugin.system.issuetabpanels:all-tabpanel
]

Michael Dürig updated OAK-5618:
-------------------------------
    Summary: Jenkins: checksum mismatch after transfer  (was: Build Apache Jackrabbit Oak
matrix/Ubuntu Slaves=ubuntu,jdk=JDK 1.8 (latest),nsfixtures=SEGMENT_MK,profile=integrationTesting
#1415 failed)

> Jenkins: checksum mismatch after transfer
> -----------------------------------------
>
>                 Key: OAK-5618
>                 URL: https://issues.apache.org/jira/browse/OAK-5618
>             Project: Jackrabbit Oak
>          Issue Type: Bug
>          Components: continuous integration
>    Affects Versions: 1.0.36
>            Reporter: Hudson
>
> Jenkins CI failure: https://builds.apache.org/job/Apache%20Jackrabbit%20Oak%20matrix/
> The build Apache Jackrabbit Oak matrix/Ubuntu Slaves=ubuntu,jdk=JDK 1.8 (latest),nsfixtures=SEGMENT_MK,profile=integrationTesting
#1415 has failed.
> First failed run: [Apache Jackrabbit Oak matrix/Ubuntu Slaves=ubuntu,jdk=JDK 1.8 (latest),nsfixtures=SEGMENT_MK,profile=integrationTesting
#1415|https://builds.apache.org/job/Apache%20Jackrabbit%20Oak%20matrix/Ubuntu%20Slaves=ubuntu,jdk=JDK%201.8%20(latest),nsfixtures=SEGMENT_MK,profile=integrationTesting/1415/]
[console log|https://builds.apache.org/job/Apache%20Jackrabbit%20Oak%20matrix/Ubuntu%20Slaves=ubuntu,jdk=JDK%201.8%20(latest),nsfixtures=SEGMENT_MK,profile=integrationTesting/1415/console]
> {noformat}
> [FINDBUGS] Skipping publisher since build result is FAILURE
> Archiving artifacts
> ERROR: Failed to archive {oak-mk/target/unit-tests.log=oak-mk/target/unit-tests.log,
oak-jcr/target/unit-tests.log=oak-jcr/target/unit-tests.log, oak-core/target/unit-tests.log=oak-core/target/unit-tests.log}
due to internal error; falling back to full archiving
> java.lang.IllegalStateException: checksum mismatch after transfer (3474872587727286585
vs. 4233022090); /x1/jenkins/jenkins-home/jobs/Apache Jackrabbit Oak matrix/configurations/axis-Ubuntu
Slaves/ubuntu/axis-jdk/JDK%201.8%20(latest)/axis-nsfixtures/SEGMENT_MK/axis-profile/integrationTesting/builds/1415/archive/oak-jcr/target/unit-tests.log
may be corrupted
> 	at jsync.protocol.FileSequenceReader.read(FileSequenceReader.java:45)
> 	at com.cloudbees.jenkins.plugins.jsync.archiver.JSyncArtifactManager.remoteSync(JSyncArtifactManager.java:158)
> 	at com.cloudbees.jenkins.plugins.jsync.archiver.JSyncArtifactManager.archive(JSyncArtifactManager.java:76)
> 	at hudson.tasks.ArtifactArchiver.perform(ArtifactArchiver.java:238)
> 	at hudson.tasks.BuildStepCompatibilityLayer.perform(BuildStepCompatibilityLayer.java:78)
> 	at hudson.tasks.BuildStepMonitor$1.perform(BuildStepMonitor.java:20)
> 	at hudson.model.AbstractBuild$AbstractBuildExecution.perform(AbstractBuild.java:779)
> 	at hudson.model.AbstractBuild$AbstractBuildExecution.performAllBuildSteps(AbstractBuild.java:720)
> 	at hudson.model.Build$BuildExecution.post2(Build.java:185)
> 	at hudson.model.AbstractBuild$AbstractBuildExecution.post(AbstractBuild.java:665)
> 	at hudson.model.Run.execute(Run.java:1766)
> 	at hudson.matrix.MatrixRun.run(MatrixRun.java:146)
> 	at hudson.model.ResourceController.execute(ResourceController.java:98)
> 	at hudson.model.Executor.run(Executor.java:410)
> Recording test results
> Build failed, created JIRA issue OAK-5618
> Finished: FAILURE
> {noformat}



--
This message was sent by Atlassian JIRA
(v6.3.15#6346)

Mime
View raw message