jclouds-notifications mailing list archives

Site index · List index
Message view « Date » · « Thread »
Top « Date » · « Thread »
From jenkins-no-re...@cloudbees.com
Subject Build failed in Jenkins: jclouds-guava-guice-compat » 18.0,3.0,OpenJDK 7 (latest) #35
Date Thu, 19 Nov 2015 20:47:03 GMT
See <https://jclouds.ci.cloudbees.com/job/jclouds-guava-guice-compat/GUAVA_VERSION=18.0,GUICE_VERSION=3.0,jdk=OpenJDK%207%20(latest)/35/changes>

Changes:

[Zack Shoylev] Fixes a windows locale bug with the "Everyone" principal

------------------------------------------
[...truncated 29209 lines...]
[pool-20-thread-1] Test testListWithPrefix(org.jclouds.blobstore.strategy.internal.ListContainerTest)
succeeded: 0ms
Test suite progress: tests succeeded: 112, failed: 1, skipped: 0.
Starting test testListWithPrefixAndDelimiter(org.jclouds.blobstore.strategy.internal.ListContainerTest)
[pool-20-thread-1] Test testListWithPrefixAndDelimiter(org.jclouds.blobstore.strategy.internal.ListContainerTest)
succeeded: 1ms
Test suite progress: tests succeeded: 113, failed: 1, skipped: 0.
Starting test testAllContains(org.jclouds.blobstore.TransientApiMetadataTest)
Starting test testTransformableToContains(org.jclouds.blobstore.TransientApiMetadataTest)
Starting test testWithId(org.jclouds.blobstore.TransientApiMetadataTest)
[pool-22-thread-1] Test testAllContains(org.jclouds.blobstore.TransientApiMetadataTest) succeeded:
1ms
Test suite progress: tests succeeded: 114, failed: 1, skipped: 0.
[pool-22-thread-3] Test testWithId(org.jclouds.blobstore.TransientApiMetadataTest) succeeded:
1ms
Test suite progress: tests succeeded: 115, failed: 1, skipped: 0.
[pool-22-thread-2] Test testTransformableToContains(org.jclouds.blobstore.TransientApiMetadataTest)
succeeded: 1ms
Test suite progress: tests succeeded: 116, failed: 1, skipped: 0.
Starting test testMustBeBlob(org.jclouds.blobstore.binders.BindBlobToMultipartFormTest)
Starting test testNullIsBad(org.jclouds.blobstore.binders.BindBlobToMultipartFormTest)
Starting test testSinglePart(org.jclouds.blobstore.binders.BindBlobToMultipartFormTest)
[pool-23-thread-2] Test testNullIsBad(org.jclouds.blobstore.binders.BindBlobToMultipartFormTest)
succeeded: 1ms
Test suite progress: tests succeeded: 117, failed: 1, skipped: 0.
[pool-23-thread-1] Test testMustBeBlob(org.jclouds.blobstore.binders.BindBlobToMultipartFormTest)
succeeded: 1ms
Test suite progress: tests succeeded: 118, failed: 1, skipped: 0.
[pool-23-thread-3] Test testSinglePart(org.jclouds.blobstore.binders.BindBlobToMultipartFormTest)
succeeded: 8ms
Test suite progress: tests succeeded: 119, failed: 1, skipped: 0.
Starting test testListAllForUnknownContainerFromTransientBlobStore(org.jclouds.blobstore.BlobStoresTest)
[pool-24-thread-1] Test testListAllForUnknownContainerFromTransientBlobStore(org.jclouds.blobstore.BlobStoresTest)
succeeded: 42ms
Test suite progress: tests succeeded: 120, failed: 1, skipped: 0.
Starting test testListAllForUnknownContainerFromTransientBlobStoreEagerly(org.jclouds.blobstore.BlobStoresTest)
[pool-24-thread-1] Test testListAllForUnknownContainerFromTransientBlobStoreEagerly(org.jclouds.blobstore.BlobStoresTest)
succeeded: 55ms
Test suite progress: tests succeeded: 121, failed: 1, skipped: 0.
Starting test testListAllFromTransientBlobStore(org.jclouds.blobstore.BlobStoresTest)
[pool-24-thread-1] Test testListAllFromTransientBlobStore(org.jclouds.blobstore.BlobStoresTest)
succeeded: 74ms
Test suite progress: tests succeeded: 122, failed: 1, skipped: 0.
Starting test testListAllFromTransientBlobStoreEagerly(org.jclouds.blobstore.BlobStoresTest)
[pool-24-thread-1] Test testListAllFromTransientBlobStoreEagerly(org.jclouds.blobstore.BlobStoresTest)
succeeded: 69ms
Test suite progress: tests succeeded: 123, failed: 1, skipped: 0.
Starting test testListAllWhenOnePage(org.jclouds.blobstore.BlobStoresTest)
[pool-24-thread-1] Test testListAllWhenOnePage(org.jclouds.blobstore.BlobStoresTest) succeeded:
4ms
Test suite progress: tests succeeded: 124, failed: 1, skipped: 0.
Starting test testListAllWhenTwoPages(org.jclouds.blobstore.BlobStoresTest)
[pool-24-thread-1] Test testListAllWhenTwoPages(org.jclouds.blobstore.BlobStoresTest) succeeded:
1ms
Test suite progress: tests succeeded: 125, failed: 1, skipped: 0.
Starting test test(org.jclouds.blobstore.BlobStoreContextFactoryTest)
[pool-29-thread-1] Test test(org.jclouds.blobstore.BlobStoreContextFactoryTest) succeeded:
2ms
Test suite progress: tests succeeded: 126, failed: 1, skipped: 0.
Starting test testNoPassword(org.jclouds.blobstore.BlobStoreContextFactoryTest)
[pool-29-thread-2] Test testNoPassword(org.jclouds.blobstore.BlobStoreContextFactoryTest)
succeeded: 1ms
Test suite progress: tests succeeded: 127, failed: 1, skipped: 0.
Starting test testSignRemoveBlob(org.jclouds.blobstore.TransientBlobRequestSignerTest)
Starting test testSignGetBlob(org.jclouds.blobstore.TransientBlobRequestSignerTest)
Starting test testSignPutBlob(org.jclouds.blobstore.TransientBlobRequestSignerTest)
Starting test testSignPutBlobWithGenerate(org.jclouds.blobstore.TransientBlobRequestSignerTest)
[pool-30-thread-4] Test testSignRemoveBlob(org.jclouds.blobstore.TransientBlobRequestSignerTest)
succeeded: 20ms
Test suite progress: tests succeeded: 128, failed: 1, skipped: 0.
[pool-30-thread-3] Test testSignPutBlobWithGenerate(org.jclouds.blobstore.TransientBlobRequestSignerTest)
succeeded: 8ms
Test suite progress: tests succeeded: 129, failed: 1, skipped: 0.
[pool-30-thread-2] Test testSignPutBlob(org.jclouds.blobstore.TransientBlobRequestSignerTest)
succeeded: 18ms
Test suite progress: tests succeeded: 130, failed: 1, skipped: 0.
[pool-30-thread-1] Test testSignGetBlob(org.jclouds.blobstore.TransientBlobRequestSignerTest)
succeeded: 22ms
Test suite progress: tests succeeded: 131, failed: 1, skipped: 0.
Tests run: 132, Failures: 1, Errors: 0, Skipped: 0, Time elapsed: 9.472 sec <<< FAILURE!
- in TestSuite
testStrategies(org.jclouds.blobstore.strategy.internal.BiggerThanPageSizeTest)  Time elapsed:
0.883 sec  <<< FAILURE!
java.lang.IllegalStateException: blob 998 is not present although it was in the list of poo
	at com.google.common.base.Preconditions.checkState(Preconditions.java:173)
	at org.jclouds.blobstore.config.LocalBlobStore$1.apply(LocalBlobStore.java:252)
	at org.jclouds.blobstore.config.LocalBlobStore$1.apply(LocalBlobStore.java:243)
	at com.google.common.collect.Iterators$8.transform(Iterators.java:799)
	at com.google.common.collect.TransformedIterator.next(TransformedIterator.java:48)
	at com.google.common.collect.Iterators.addAll(Iterators.java:362)
	at com.google.common.collect.Iterables.addAll(Iterables.java:354)
	at com.google.common.collect.Sets.newTreeSet(Sets.java:365)
	at org.jclouds.blobstore.config.LocalBlobStore.list(LocalBlobStore.java:242)
	at sun.reflect.NativeMethodAccessorImpl.invoke0(Native Method)
	at sun.reflect.NativeMethodAccessorImpl.invoke(NativeMethodAccessorImpl.java:57)
	at sun.reflect.DelegatingMethodAccessorImpl.invoke(DelegatingMethodAccessorImpl.java:43)
	at java.lang.reflect.Method.invoke(Method.java:606)
	at com.google.inject.internal.DelegatingInvocationHandler.invoke(DelegatingInvocationHandler.java:37)
	at com.sun.proxy.$Proxy39.list(Unknown Source)
	at org.jclouds.blobstore.strategy.internal.DeleteAllKeysInList.getListing(DeleteAllKeysInList.java:146)
	at org.jclouds.blobstore.strategy.internal.DeleteAllKeysInList.executeOneIteration(DeleteAllKeysInList.java:355)
	at org.jclouds.blobstore.strategy.internal.DeleteAllKeysInList.execute(DeleteAllKeysInList.java:416)
	at org.jclouds.blobstore.util.internal.BlobUtilsImpl.clearContainer(BlobUtilsImpl.java:77)
	at org.jclouds.blobstore.config.LocalBlobStore.clearContainer(LocalBlobStore.java:175)
	at org.jclouds.blobstore.config.LocalBlobStore.clearContainer(LocalBlobStore.java:170)
	at sun.reflect.NativeMethodAccessorImpl.invoke0(Native Method)
	at sun.reflect.NativeMethodAccessorImpl.invoke(NativeMethodAccessorImpl.java:57)
	at sun.reflect.DelegatingMethodAccessorImpl.invoke(DelegatingMethodAccessorImpl.java:43)
	at java.lang.reflect.Method.invoke(Method.java:606)
	at com.google.inject.internal.DelegatingInvocationHandler.invoke(DelegatingInvocationHandler.java:37)
	at com.sun.proxy.$Proxy39.clearContainer(Unknown Source)
	at org.jclouds.blobstore.strategy.internal.BiggerThanPageSizeTest.testStrategies(BiggerThanPageSizeTest.java:58)


Results :

Failed tests: 
  BiggerThanPageSizeTest.testStrategies:58 » IllegalState blob 998 is not presen...

Tests run: 132, Failures: 1, Errors: 0, Skipped: 0

[INFO] ------------------------------------------------------------------------
[INFO] Reactor Summary:
[INFO] 
[INFO] Apache jclouds Project ............................ SUCCESS [24.344s]
[INFO] jclouds shared Maven resources .................... SUCCESS [5.480s]
[INFO] jclouds Components Core ........................... SUCCESS [1:30.825s]
[INFO] jclouds SLF4J Logging Module ...................... SUCCESS [2.207s]
[INFO] jclouds OAuth core ................................ SUCCESS [5.062s]
[INFO] jclouds Google Cloud Core ......................... SUCCESS [2.542s]
[INFO] jclouds OpenStack Components Core ................. SUCCESS [20.097s]
[INFO] jclouds commons project ........................... SUCCESS [0.822s]
[INFO] jclouds script builder ............................ SUCCESS [5.534s]
[INFO] jclouds compute core .............................. SUCCESS [52.540s]
[INFO] jclouds Log4J Logging Module ...................... SUCCESS [2.223s]
[INFO] jclouds loadbalancer core ......................... SUCCESS [1.905s]
[INFO] jclouds sts api ................................... SUCCESS [5.982s]
[INFO] jclouds cloudwatch api ............................ SUCCESS [8.329s]
[INFO] jclouds bouncycastle EncryptionService Module ..... SUCCESS [4.704s]
[INFO] jclouds sshj ssh client ........................... SUCCESS [4.793s]
[INFO] jclouds cloudstack core ........................... SUCCESS [41.181s]
[INFO] jclouds blobstore core ............................ FAILURE [11.572s]
[INFO] jclouds filesystem core ........................... SKIPPED
[INFO] jclouds bring your own node provider .............. SKIPPED
[INFO] jclouds OkHttp Driver ............................. SKIPPED
[INFO] jclouds s3 api .................................... SKIPPED
[INFO] jclouds ec2 api ................................... SKIPPED
[INFO] jclouds sqs api ................................... SKIPPED
[INFO] jclouds elasticstack core ......................... SKIPPED
[INFO] jclouds atmos components .......................... SKIPPED
[INFO] jclouds openstack-keystone api .................... SKIPPED
[INFO] jclouds openstack-cinder api ...................... SKIPPED
[INFO] Apache jclouds :: OpenStack :: Nova API ........... SKIPPED
[INFO] jclouds openstack-nova-ec2 api .................... SKIPPED
[INFO] jclouds openstack-swift api ....................... SKIPPED
[INFO] jclouds openstack-trove api ....................... SKIPPED
[INFO] jclouds rackspace cloudidentity api ............... SKIPPED
[INFO] jclouds Rackspace Cloud Load Balancers API ........ SKIPPED
[INFO] jclouds Rackspace Next Generation Cloud Block Storage US provider  SKIPPED
[INFO] jclouds Rackspace Next Generation Cloud Servers US provider  SKIPPED
[INFO] jclouds rackspace clouddns api .................... SKIPPED
[INFO] jclouds rackspace-cloudfiles api .................. SKIPPED
[INFO] jclouds route53 api ............................... SKIPPED
[INFO] jclouds Chef api .................................. SKIPPED
[INFO] jclouds apis project .............................. SKIPPED
[INFO] jclouds GoGrid provider ........................... SKIPPED
[INFO] jclouds Azure Storage provider .................... SKIPPED
[INFO] jclouds Apache Http Components Client ............. SKIPPED
[INFO] jclouds joda DateService Module ................... SKIPPED
[INFO] jclouds netty payload module ...................... SKIPPED
[INFO] jclouds enterprise Module ......................... SKIPPED
[INFO] jclouds Amazon Simple Storage Service (S3) provider  SKIPPED
[INFO] jclouds Amazon Elastic Load Balancer provider ..... SKIPPED
[INFO] jclouds Amazon EC2 provider ....................... SKIPPED
[INFO] jclouds Amazon Simple Queue Service provider ...... SKIPPED
[INFO] jclouds ElasticHosts Peer1 London provider ........ SKIPPED
[INFO] jclouds ElasticHosts Peer1 San Antonio provider ... SKIPPED
[INFO] jclouds ElasticHosts BlueSquare London provider ... SKIPPED
[INFO] jclouds ElasticHosts Peer1 Toronto provider ....... SKIPPED
[INFO] jclouds ElasticHosts Peer1 Los Angeles provider ... SKIPPED
[INFO] jclouds ElasticHosts Amsterdam provider ........... SKIPPED
[INFO] jclouds ElasticHosts San Jose provider ............ SKIPPED
[INFO] jclouds ElasticHosts Hong Kong provider ........... SKIPPED
[INFO] jclouds ElasticHosts Sydney provider .............. SKIPPED
[INFO] jclouds ElasticHosts Miami provider ............... SKIPPED
[INFO] jclouds ElasticHosts Dallas provider .............. SKIPPED
[INFO] jclouds Open Hosting East1 provider ............... SKIPPED
[INFO] jclouds Serverlove Manchester provider ............ SKIPPED
[INFO] jclouds SkaliCloud Malaysia provider .............. SKIPPED
[INFO] jclouds Go2Cloud Johannesburg1 provider ........... SKIPPED
[INFO] jclouds Google Compute Engine provider ............ SKIPPED
[INFO] jclouds SoftLayer core ............................ SKIPPED
[INFO] jclouds Rackspace Cloud Files US provider ......... SKIPPED
[INFO] jclouds Rackspace Cloud Files UK provider ......... SKIPPED
[INFO] jclouds Rackspace Next Generation Cloud DNS US provider  SKIPPED
[INFO] jclouds Rackspace Next Generation Cloud DNS UK provider  SKIPPED
[INFO] jclouds Rackspace Cloud Databases US provider ..... SKIPPED
[INFO] jclouds Rackspace Cloud Databases UK provider ..... SKIPPED
[INFO] jclouds Rackspace Cloud Load Balancers US provider  SKIPPED
[INFO] jclouds Rackspace Cloud Load Balancers UK provider  SKIPPED
[INFO] jclouds Rackspace Next Generation Cloud Block Storage UK provider  SKIPPED
[INFO] jclouds Rackspace Next Generation Cloud Servers provider  SKIPPED
[INFO] jclouds GleSYS core ............................... SKIPPED
[INFO] jclouds Amazon Identity and Access Management (STS) provider  SKIPPED
[INFO] jclouds Amazon Route 53 provider .................. SKIPPED
[INFO] jclouds ultradns-ws provider ...................... SKIPPED
[INFO] jclouds dynect api ................................ SKIPPED
[INFO] jclouds providers project ......................... SKIPPED
[INFO] jclouds jsch ssh client ........................... SKIPPED
[INFO] jclouds example components for a standalone compute provider  SKIPPED
[INFO] jclouds skeletons project ......................... SKIPPED
[INFO] jclouds Google App Engine Components .............. SKIPPED
[INFO] jclouds drivers project ........................... SKIPPED
[INFO] allcompute ........................................ SKIPPED
[INFO] allblobstore ...................................... SKIPPED
[INFO] allloadbalancer ................................... SKIPPED
[INFO] all ............................................... SKIPPED
[INFO] Apache jclouds .................................... SKIPPED
[INFO] ------------------------------------------------------------------------
[INFO] BUILD FAILURE
[INFO] ------------------------------------------------------------------------
[INFO] Total time: 4:55.701s
[INFO] Finished at: Thu Nov 19 15:46:47 EST 2015
[INFO] Final Memory: 82M/290M
[INFO] ------------------------------------------------------------------------
[ERROR] Failed to execute goal org.apache.maven.plugins:maven-surefire-plugin:2.17:test (default-test)
on project jclouds-blobstore: There are test failures.
[ERROR] 
[ERROR] Please refer to <https://jclouds.ci.cloudbees.com/job/jclouds-guava-guice-compat/GUAVA_VERSION=18.0,GUICE_VERSION=3.0,jdk=OpenJDK%207%20(latest)/ws/blobstore/target/surefire-reports>
for the individual test results.
[ERROR] -> [Help 1]
org.apache.maven.lifecycle.LifecycleExecutionException: Failed to execute goal org.apache.maven.plugins:maven-surefire-plugin:2.17:test
(default-test) on project jclouds-blobstore: There are test failures.

Please refer to <https://jclouds.ci.cloudbees.com/job/jclouds-guava-guice-compat/GUAVA_VERSION=18.0,GUICE_VERSION=3.0,jdk=OpenJDK%207%20(latest)/ws/blobstore/target/surefire-reports>
for the individual test results.
	at org.apache.maven.lifecycle.internal.MojoExecutor.execute(MojoExecutor.java:213)
	at org.apache.maven.lifecycle.internal.MojoExecutor.execute(MojoExecutor.java:153)
	at org.apache.maven.lifecycle.internal.MojoExecutor.execute(MojoExecutor.java:145)
	at org.apache.maven.lifecycle.internal.LifecycleModuleBuilder.buildProject(LifecycleModuleBuilder.java:84)
	at org.apache.maven.lifecycle.internal.LifecycleModuleBuilder.buildProject(LifecycleModuleBuilder.java:59)
	at org.apache.maven.lifecycle.internal.LifecycleStarter.singleThreadedBuild(LifecycleStarter.java:183)
	at org.apache.maven.lifecycle.internal.LifecycleStarter.execute(LifecycleStarter.java:161)
	at org.apache.maven.DefaultMaven.doExecute(DefaultMaven.java:320)
	at org.apache.maven.DefaultMaven.execute(DefaultMaven.java:156)
	at org.apache.maven.cli.MavenCli.execute(MavenCli.java:537)
	at org.apache.maven.cli.MavenCli.doMain(MavenCli.java:196)
	at org.apache.maven.cli.MavenCli.main(MavenCli.java:141)
	at sun.reflect.NativeMethodAccessorImpl.invoke0(Native Method)
	at sun.reflect.NativeMethodAccessorImpl.invoke(NativeMethodAccessorImpl.java:57)
	at sun.reflect.DelegatingMethodAccessorImpl.invoke(DelegatingMethodAccessorImpl.java:43)
	at java.lang.reflect.Method.invoke(Method.java:606)
	at org.codehaus.plexus.classworlds.launcher.Launcher.launchEnhanced(Launcher.java:290)
	at org.codehaus.plexus.classworlds.launcher.Launcher.launch(Launcher.java:230)
	at org.codehaus.plexus.classworlds.launcher.Launcher.mainWithExitCode(Launcher.java:409)
	at org.codehaus.plexus.classworlds.launcher.Launcher.main(Launcher.java:352)
Caused by: org.apache.maven.plugin.MojoFailureException: There are test failures.

Please refer to <https://jclouds.ci.cloudbees.com/job/jclouds-guava-guice-compat/GUAVA_VERSION=18.0,GUICE_VERSION=3.0,jdk=OpenJDK%207%20(latest)/ws/blobstore/target/surefire-reports>
for the individual test results.
	at org.apache.maven.plugin.surefire.SurefireHelper.reportExecution(SurefireHelper.java:82)
	at org.apache.maven.plugin.surefire.SurefirePlugin.handleSummary(SurefirePlugin.java:195)
	at org.apache.maven.plugin.surefire.AbstractSurefireMojo.executeAfterPreconditionsChecked(AbstractSurefireMojo.java:861)
	at org.apache.maven.plugin.surefire.AbstractSurefireMojo.execute(AbstractSurefireMojo.java:729)
	at org.apache.maven.plugin.DefaultBuildPluginManager.executeMojo(DefaultBuildPluginManager.java:101)
	at org.apache.maven.lifecycle.internal.MojoExecutor.execute(MojoExecutor.java:209)
	... 19 more
[ERROR] 
[ERROR] Re-run Maven using the -X switch to enable full debug logging.
[ERROR] 
[ERROR] For more information about the errors and possible solutions, please read the following
articles:
[ERROR] [Help 1] http://cwiki.apache.org/confluence/display/MAVEN/MojoFailureException
[ERROR] 
[ERROR] After correcting the problems, you can resume the build with the command
[ERROR]   mvn <goals> -rf :jclouds-blobstore
Build step 'Invoke top-level Maven targets' marked build as failure

Mime
View raw message