jclouds-notifications mailing list archives

Site index · List index
Message view « Date » · « Thread »
Top « Date » · « Thread »
From Apache Jenkins Server <jenk...@builds.apache.org>
Subject Build failed in Jenkins: jclouds-with-credentials » jclouds-packet-live-tests #77
Date Tue, 28 Apr 2020 05:06:54 GMT
See <https://builds.apache.org/job/jclouds-with-credentials/job/jclouds-packet-live-tests/77/display/redirect?page=changes>

Changes:

[github] Fix toolchain setup on jenkins (#68)

[nacx] JCLOUDS-1543: remove unused imports from FetchBlobMetadataTest.java


------------------------------------------
[...truncated 66.07 KB...]
[WARNING] Some problems were encountered while building the effective model for org.apache.jclouds.provider:google-cloud-storage:bundle:2.3.0-SNAPSHOT
[WARNING] 'reporting.plugins.plugin.version' for org.apache.maven.plugins:maven-checkstyle-plugin
is missing. @ org.apache.jclouds:jclouds-project:2.3.0-SNAPSHOT, <https://builds.apache.org/job/jclouds-with-credentials/job/jclouds-packet-live-tests/ws/project/pom.xml,>
line 1196, column 15
[WARNING] 
[WARNING] Some problems were encountered while building the effective model for org.apache.jclouds.provider:google-compute-engine:bundle:2.3.0-SNAPSHOT
[WARNING] 'reporting.plugins.plugin.version' for org.apache.maven.plugins:maven-checkstyle-plugin
is missing. @ org.apache.jclouds:jclouds-project:2.3.0-SNAPSHOT, <https://builds.apache.org/job/jclouds-with-credentials/job/jclouds-packet-live-tests/ws/project/pom.xml,>
line 1196, column 15
[WARNING] 
[WARNING] Some problems were encountered while building the effective model for org.apache.jclouds.provider:openhosting-east1:bundle:2.3.0-SNAPSHOT
[WARNING] 'reporting.plugins.plugin.version' for org.apache.maven.plugins:maven-checkstyle-plugin
is missing. @ org.apache.jclouds:jclouds-project:2.3.0-SNAPSHOT, <https://builds.apache.org/job/jclouds-with-credentials/job/jclouds-packet-live-tests/ws/project/pom.xml,>
line 1196, column 15
[WARNING] 
[WARNING] Some problems were encountered while building the effective model for org.apache.jclouds.provider:packet:bundle:2.3.0-SNAPSHOT
[WARNING] 'reporting.plugins.plugin.version' for org.apache.maven.plugins:maven-checkstyle-plugin
is missing. @ org.apache.jclouds:jclouds-project:2.3.0-SNAPSHOT, <https://builds.apache.org/job/jclouds-with-credentials/job/jclouds-packet-live-tests/ws/project/pom.xml,>
line 1196, column 15
[WARNING] 
[WARNING] Some problems were encountered while building the effective model for org.apache.jclouds.provider:profitbricks:bundle:2.3.0-SNAPSHOT
[WARNING] 'reporting.plugins.plugin.version' for org.apache.maven.plugins:maven-checkstyle-plugin
is missing. @ org.apache.jclouds:jclouds-project:2.3.0-SNAPSHOT, <https://builds.apache.org/job/jclouds-with-credentials/job/jclouds-packet-live-tests/ws/project/pom.xml,>
line 1196, column 15
[WARNING] 
[WARNING] Some problems were encountered while building the effective model for org.apache.jclouds.provider:rackspace-cloudblockstorage-uk:bundle:2.3.0-SNAPSHOT
[WARNING] 'reporting.plugins.plugin.version' for org.apache.maven.plugins:maven-checkstyle-plugin
is missing. @ org.apache.jclouds:jclouds-project:2.3.0-SNAPSHOT, <https://builds.apache.org/job/jclouds-with-credentials/job/jclouds-packet-live-tests/ws/project/pom.xml,>
line 1196, column 15
[WARNING] 
[WARNING] Some problems were encountered while building the effective model for org.apache.jclouds.provider:rackspace-cloudblockstorage-us:bundle:2.3.0-SNAPSHOT
[WARNING] 'reporting.plugins.plugin.version' for org.apache.maven.plugins:maven-checkstyle-plugin
is missing. @ org.apache.jclouds:jclouds-project:2.3.0-SNAPSHOT, <https://builds.apache.org/job/jclouds-with-credentials/job/jclouds-packet-live-tests/ws/project/pom.xml,>
line 1196, column 15
[WARNING] 
[WARNING] Some problems were encountered while building the effective model for org.apache.jclouds.provider:rackspace-clouddatabases-uk:bundle:2.3.0-SNAPSHOT
[WARNING] 'reporting.plugins.plugin.version' for org.apache.maven.plugins:maven-checkstyle-plugin
is missing. @ org.apache.jclouds:jclouds-project:2.3.0-SNAPSHOT, <https://builds.apache.org/job/jclouds-with-credentials/job/jclouds-packet-live-tests/ws/project/pom.xml,>
line 1196, column 15
[WARNING] 
[WARNING] Some problems were encountered while building the effective model for org.apache.jclouds.provider:rackspace-clouddatabases-us:bundle:2.3.0-SNAPSHOT
[WARNING] 'reporting.plugins.plugin.version' for org.apache.maven.plugins:maven-checkstyle-plugin
is missing. @ org.apache.jclouds:jclouds-project:2.3.0-SNAPSHOT, <https://builds.apache.org/job/jclouds-with-credentials/job/jclouds-packet-live-tests/ws/project/pom.xml,>
line 1196, column 15
[WARNING] 
[WARNING] Some problems were encountered while building the effective model for org.apache.jclouds.provider:rackspace-clouddns-uk:bundle:2.3.0-SNAPSHOT
[WARNING] 'reporting.plugins.plugin.version' for org.apache.maven.plugins:maven-checkstyle-plugin
is missing. @ org.apache.jclouds:jclouds-project:2.3.0-SNAPSHOT, <https://builds.apache.org/job/jclouds-with-credentials/job/jclouds-packet-live-tests/ws/project/pom.xml,>
line 1196, column 15
[WARNING] 
[WARNING] Some problems were encountered while building the effective model for org.apache.jclouds.provider:rackspace-clouddns-us:bundle:2.3.0-SNAPSHOT
[WARNING] 'reporting.plugins.plugin.version' for org.apache.maven.plugins:maven-checkstyle-plugin
is missing. @ org.apache.jclouds:jclouds-project:2.3.0-SNAPSHOT, <https://builds.apache.org/job/jclouds-with-credentials/job/jclouds-packet-live-tests/ws/project/pom.xml,>
line 1196, column 15
[WARNING] 
[WARNING] Some problems were encountered while building the effective model for org.apache.jclouds.provider:rackspace-cloudfiles-uk:bundle:2.3.0-SNAPSHOT
[WARNING] 'reporting.plugins.plugin.version' for org.apache.maven.plugins:maven-checkstyle-plugin
is missing. @ org.apache.jclouds:jclouds-project:2.3.0-SNAPSHOT, <https://builds.apache.org/job/jclouds-with-credentials/job/jclouds-packet-live-tests/ws/project/pom.xml,>
line 1196, column 15
[WARNING] 
[WARNING] Some problems were encountered while building the effective model for org.apache.jclouds.provider:rackspace-cloudfiles-us:bundle:2.3.0-SNAPSHOT
[WARNING] 'reporting.plugins.plugin.version' for org.apache.maven.plugins:maven-checkstyle-plugin
is missing. @ org.apache.jclouds:jclouds-project:2.3.0-SNAPSHOT, <https://builds.apache.org/job/jclouds-with-credentials/job/jclouds-packet-live-tests/ws/project/pom.xml,>
line 1196, column 15
[WARNING] 
[WARNING] Some problems were encountered while building the effective model for org.apache.jclouds.provider:rackspace-cloudloadbalancers-uk:bundle:2.3.0-SNAPSHOT
[WARNING] 'reporting.plugins.plugin.version' for org.apache.maven.plugins:maven-checkstyle-plugin
is missing. @ org.apache.jclouds:jclouds-project:2.3.0-SNAPSHOT, <https://builds.apache.org/job/jclouds-with-credentials/job/jclouds-packet-live-tests/ws/project/pom.xml,>
line 1196, column 15
[WARNING] 
[WARNING] Some problems were encountered while building the effective model for org.apache.jclouds.provider:rackspace-cloudloadbalancers-us:bundle:2.3.0-SNAPSHOT
[WARNING] 'reporting.plugins.plugin.version' for org.apache.maven.plugins:maven-checkstyle-plugin
is missing. @ org.apache.jclouds:jclouds-project:2.3.0-SNAPSHOT, <https://builds.apache.org/job/jclouds-with-credentials/job/jclouds-packet-live-tests/ws/project/pom.xml,>
line 1196, column 15
[WARNING] 
[WARNING] Some problems were encountered while building the effective model for org.apache.jclouds.provider:rackspace-cloudnetworks-uk:bundle:2.3.0-SNAPSHOT
[WARNING] 'reporting.plugins.plugin.version' for org.apache.maven.plugins:maven-checkstyle-plugin
is missing. @ org.apache.jclouds:jclouds-project:2.3.0-SNAPSHOT, <https://builds.apache.org/job/jclouds-with-credentials/job/jclouds-packet-live-tests/ws/project/pom.xml,>
line 1196, column 15
[WARNING] 
[WARNING] Some problems were encountered while building the effective model for org.apache.jclouds.provider:rackspace-cloudnetworks-us:bundle:2.3.0-SNAPSHOT
[WARNING] 'reporting.plugins.plugin.version' for org.apache.maven.plugins:maven-checkstyle-plugin
is missing. @ org.apache.jclouds:jclouds-project:2.3.0-SNAPSHOT, <https://builds.apache.org/job/jclouds-with-credentials/job/jclouds-packet-live-tests/ws/project/pom.xml,>
line 1196, column 15
[WARNING] 
[WARNING] Some problems were encountered while building the effective model for org.apache.jclouds.provider:rackspace-cloudservers-uk:bundle:2.3.0-SNAPSHOT
[WARNING] 'reporting.plugins.plugin.version' for org.apache.maven.plugins:maven-checkstyle-plugin
is missing. @ org.apache.jclouds:jclouds-project:2.3.0-SNAPSHOT, <https://builds.apache.org/job/jclouds-with-credentials/job/jclouds-packet-live-tests/ws/project/pom.xml,>
line 1196, column 15
[WARNING] 
[WARNING] Some problems were encountered while building the effective model for org.apache.jclouds.provider:rackspace-cloudservers-us:bundle:2.3.0-SNAPSHOT
[WARNING] 'reporting.plugins.plugin.version' for org.apache.maven.plugins:maven-checkstyle-plugin
is missing. @ org.apache.jclouds:jclouds-project:2.3.0-SNAPSHOT, <https://builds.apache.org/job/jclouds-with-credentials/job/jclouds-packet-live-tests/ws/project/pom.xml,>
line 1196, column 15
[WARNING] 
[WARNING] Some problems were encountered while building the effective model for org.apache.jclouds.provider:serverlove-z1-man:bundle:2.3.0-SNAPSHOT
[WARNING] 'reporting.plugins.plugin.version' for org.apache.maven.plugins:maven-checkstyle-plugin
is missing. @ org.apache.jclouds:jclouds-project:2.3.0-SNAPSHOT, <https://builds.apache.org/job/jclouds-with-credentials/job/jclouds-packet-live-tests/ws/project/pom.xml,>
line 1196, column 15
[WARNING] 
[WARNING] Some problems were encountered while building the effective model for org.apache.jclouds.provider:skalicloud-sdg-my:bundle:2.3.0-SNAPSHOT
[WARNING] 'reporting.plugins.plugin.version' for org.apache.maven.plugins:maven-checkstyle-plugin
is missing. @ org.apache.jclouds:jclouds-project:2.3.0-SNAPSHOT, <https://builds.apache.org/job/jclouds-with-credentials/job/jclouds-packet-live-tests/ws/project/pom.xml,>
line 1196, column 15
[WARNING] 
[WARNING] Some problems were encountered while building the effective model for org.apache.jclouds.provider:softlayer:bundle:2.3.0-SNAPSHOT
[WARNING] 'reporting.plugins.plugin.version' for org.apache.maven.plugins:maven-checkstyle-plugin
is missing. @ org.apache.jclouds:jclouds-project:2.3.0-SNAPSHOT, <https://builds.apache.org/job/jclouds-with-credentials/job/jclouds-packet-live-tests/ws/project/pom.xml,>
line 1196, column 15
[WARNING] 
[WARNING] Some problems were encountered while building the effective model for org.apache.jclouds.provider:ultradns-ws:bundle:2.3.0-SNAPSHOT
[WARNING] 'reporting.plugins.plugin.version' for org.apache.maven.plugins:maven-checkstyle-plugin
is missing. @ org.apache.jclouds:jclouds-project:2.3.0-SNAPSHOT, <https://builds.apache.org/job/jclouds-with-credentials/job/jclouds-packet-live-tests/ws/project/pom.xml,>
line 1196, column 15
[WARNING] 
[WARNING] Some problems were encountered while building the effective model for org.apache.jclouds.provider:jclouds-providers-project:pom:2.3.0-SNAPSHOT
[WARNING] 'reporting.plugins.plugin.version' for org.apache.maven.plugins:maven-checkstyle-plugin
is missing. @ org.apache.jclouds:jclouds-project:2.3.0-SNAPSHOT, <https://builds.apache.org/job/jclouds-with-credentials/job/jclouds-packet-live-tests/ws/project/pom.xml,>
line 1196, column 15
[WARNING] 
[WARNING] Some problems were encountered while building the effective model for org.apache.jclouds:jclouds-blobstore:bundle:2.3.0-SNAPSHOT
[WARNING] 'reporting.plugins.plugin.version' for org.apache.maven.plugins:maven-checkstyle-plugin
is missing. @ org.apache.jclouds:jclouds-project:2.3.0-SNAPSHOT, <https://builds.apache.org/job/jclouds-with-credentials/job/jclouds-packet-live-tests/ws/project/pom.xml,>
line 1196, column 15
[WARNING] 
[WARNING] Some problems were encountered while building the effective model for org.apache.jclouds.api:servermanager:bundle:2.3.0-SNAPSHOT
[WARNING] 'reporting.plugins.plugin.version' for org.apache.maven.plugins:maven-checkstyle-plugin
is missing. @ org.apache.jclouds:jclouds-project:2.3.0-SNAPSHOT, <https://builds.apache.org/job/jclouds-with-credentials/job/jclouds-packet-live-tests/ws/project/pom.xml,>
line 1196, column 15
[WARNING] 
[WARNING] Some problems were encountered while building the effective model for org.apache.jclouds:jclouds-skeletons-project:pom:2.3.0-SNAPSHOT
[WARNING] 'reporting.plugins.plugin.version' for org.apache.maven.plugins:maven-checkstyle-plugin
is missing. @ org.apache.jclouds:jclouds-project:2.3.0-SNAPSHOT, <https://builds.apache.org/job/jclouds-with-credentials/job/jclouds-packet-live-tests/ws/project/pom.xml,>
line 1196, column 15
[WARNING] 
[WARNING] Some problems were encountered while building the effective model for org.apache.jclouds.driver:jclouds-apachehc:bundle:2.3.0-SNAPSHOT
[WARNING] 'reporting.plugins.plugin.version' for org.apache.maven.plugins:maven-checkstyle-plugin
is missing. @ org.apache.jclouds:jclouds-project:2.3.0-SNAPSHOT, <https://builds.apache.org/job/jclouds-with-credentials/job/jclouds-packet-live-tests/ws/project/pom.xml,>
line 1196, column 15
[WARNING] 
[WARNING] Some problems were encountered while building the effective model for org.apache.jclouds.driver:jclouds-bouncycastle:bundle:2.3.0-SNAPSHOT
[WARNING] 'reporting.plugins.plugin.version' for org.apache.maven.plugins:maven-checkstyle-plugin
is missing. @ org.apache.jclouds:jclouds-project:2.3.0-SNAPSHOT, <https://builds.apache.org/job/jclouds-with-credentials/job/jclouds-packet-live-tests/ws/project/pom.xml,>
line 1196, column 15
[WARNING] 
[WARNING] Some problems were encountered while building the effective model for org.apache.jclouds.driver:jclouds-enterprise:bundle:2.3.0-SNAPSHOT
[WARNING] 'reporting.plugins.plugin.version' for org.apache.maven.plugins:maven-checkstyle-plugin
is missing. @ org.apache.jclouds:jclouds-project:2.3.0-SNAPSHOT, <https://builds.apache.org/job/jclouds-with-credentials/job/jclouds-packet-live-tests/ws/project/pom.xml,>
line 1196, column 15
[WARNING] 
[WARNING] Some problems were encountered while building the effective model for org.apache.jclouds.driver:jclouds-gae:bundle:2.3.0-SNAPSHOT
[WARNING] 'reporting.plugins.plugin.version' for org.apache.maven.plugins:maven-checkstyle-plugin
is missing. @ org.apache.jclouds:jclouds-project:2.3.0-SNAPSHOT, <https://builds.apache.org/job/jclouds-with-credentials/job/jclouds-packet-live-tests/ws/project/pom.xml,>
line 1196, column 15
[WARNING] 
[WARNING] Some problems were encountered while building the effective model for org.apache.jclouds.driver:jclouds-joda:bundle:2.3.0-SNAPSHOT
[WARNING] 'reporting.plugins.plugin.version' for org.apache.maven.plugins:maven-checkstyle-plugin
is missing. @ org.apache.jclouds:jclouds-project:2.3.0-SNAPSHOT, <https://builds.apache.org/job/jclouds-with-credentials/job/jclouds-packet-live-tests/ws/project/pom.xml,>
line 1196, column 15
[WARNING] 
[WARNING] Some problems were encountered while building the effective model for org.apache.jclouds.driver:jclouds-jsch:bundle:2.3.0-SNAPSHOT
[WARNING] 'reporting.plugins.plugin.version' for org.apache.maven.plugins:maven-checkstyle-plugin
is missing. @ org.apache.jclouds:jclouds-project:2.3.0-SNAPSHOT, <https://builds.apache.org/job/jclouds-with-credentials/job/jclouds-packet-live-tests/ws/project/pom.xml,>
line 1196, column 15
[WARNING] 
[WARNING] Some problems were encountered while building the effective model for org.apache.jclouds.driver:jclouds-log4j:bundle:2.3.0-SNAPSHOT
[WARNING] 'reporting.plugins.plugin.version' for org.apache.maven.plugins:maven-checkstyle-plugin
is missing. @ org.apache.jclouds:jclouds-project:2.3.0-SNAPSHOT, <https://builds.apache.org/job/jclouds-with-credentials/job/jclouds-packet-live-tests/ws/project/pom.xml,>
line 1196, column 15
[WARNING] 
[WARNING] Some problems were encountered while building the effective model for org.apache.jclouds.driver:jclouds-netty:bundle:2.3.0-SNAPSHOT
[WARNING] 'reporting.plugins.plugin.version' for org.apache.maven.plugins:maven-checkstyle-plugin
is missing. @ org.apache.jclouds:jclouds-project:2.3.0-SNAPSHOT, <https://builds.apache.org/job/jclouds-with-credentials/job/jclouds-packet-live-tests/ws/project/pom.xml,>
line 1196, column 15
[WARNING] 
[WARNING] Some problems were encountered while building the effective model for org.apache.jclouds.driver:jclouds-okhttp:bundle:2.3.0-SNAPSHOT
[WARNING] 'reporting.plugins.plugin.version' for org.apache.maven.plugins:maven-checkstyle-plugin
is missing. @ org.apache.jclouds:jclouds-project:2.3.0-SNAPSHOT, <https://builds.apache.org/job/jclouds-with-credentials/job/jclouds-packet-live-tests/ws/project/pom.xml,>
line 1196, column 15
[WARNING] 
[WARNING] Some problems were encountered while building the effective model for org.apache.jclouds.driver:jclouds-slf4j:bundle:2.3.0-SNAPSHOT
[WARNING] 'reporting.plugins.plugin.version' for org.apache.maven.plugins:maven-checkstyle-plugin
is missing. @ org.apache.jclouds:jclouds-project:2.3.0-SNAPSHOT, <https://builds.apache.org/job/jclouds-with-credentials/job/jclouds-packet-live-tests/ws/project/pom.xml,>
line 1196, column 15
[WARNING] 
[WARNING] Some problems were encountered while building the effective model for org.apache.jclouds.driver:jclouds-sshj:bundle:2.3.0-SNAPSHOT
[WARNING] 'reporting.plugins.plugin.version' for org.apache.maven.plugins:maven-checkstyle-plugin
is missing. @ org.apache.jclouds:jclouds-project:2.3.0-SNAPSHOT, <https://builds.apache.org/job/jclouds-with-credentials/job/jclouds-packet-live-tests/ws/project/pom.xml,>
line 1196, column 15
[WARNING] 
[WARNING] Some problems were encountered while building the effective model for org.apache.jclouds:jclouds-drivers-project:pom:2.3.0-SNAPSHOT
[WARNING] 'reporting.plugins.plugin.version' for org.apache.maven.plugins:maven-checkstyle-plugin
is missing. @ org.apache.jclouds:jclouds-project:2.3.0-SNAPSHOT, <https://builds.apache.org/job/jclouds-with-credentials/job/jclouds-packet-live-tests/ws/project/pom.xml,>
line 1196, column 15
[WARNING] 
[WARNING] Some problems were encountered while building the effective model for org.apache.jclouds:jclouds-scriptbuilder:bundle:2.3.0-SNAPSHOT
[WARNING] 'reporting.plugins.plugin.version' for org.apache.maven.plugins:maven-checkstyle-plugin
is missing. @ org.apache.jclouds:jclouds-project:2.3.0-SNAPSHOT, <https://builds.apache.org/job/jclouds-with-credentials/job/jclouds-packet-live-tests/ws/project/pom.xml,>
line 1196, column 15
[WARNING] 
[WARNING] Some problems were encountered while building the effective model for org.apache.jclouds:jclouds-allcompute:jar:2.3.0-SNAPSHOT
[WARNING] 'reporting.plugins.plugin.version' for org.apache.maven.plugins:maven-checkstyle-plugin
is missing. @ org.apache.jclouds:jclouds-project:2.3.0-SNAPSHOT, <https://builds.apache.org/job/jclouds-with-credentials/job/jclouds-packet-live-tests/ws/project/pom.xml,>
line 1196, column 15
[WARNING] 
[WARNING] Some problems were encountered while building the effective model for org.apache.jclouds:jclouds-allblobstore:jar:2.3.0-SNAPSHOT
[WARNING] 'reporting.plugins.plugin.version' for org.apache.maven.plugins:maven-checkstyle-plugin
is missing. @ org.apache.jclouds:jclouds-project:2.3.0-SNAPSHOT, <https://builds.apache.org/job/jclouds-with-credentials/job/jclouds-packet-live-tests/ws/project/pom.xml,>
line 1196, column 15
[WARNING] 
[WARNING] Some problems were encountered while building the effective model for org.apache.jclouds:jclouds-allloadbalancer:jar:2.3.0-SNAPSHOT
[WARNING] 'reporting.plugins.plugin.version' for org.apache.maven.plugins:maven-checkstyle-plugin
is missing. @ org.apache.jclouds:jclouds-project:2.3.0-SNAPSHOT, <https://builds.apache.org/job/jclouds-with-credentials/job/jclouds-packet-live-tests/ws/project/pom.xml,>
line 1196, column 15
[WARNING] 
[WARNING] Some problems were encountered while building the effective model for org.apache.jclouds:jclouds-all:jar:2.3.0-SNAPSHOT
[WARNING] 'reporting.plugins.plugin.version' for org.apache.maven.plugins:maven-checkstyle-plugin
is missing. @ org.apache.jclouds:jclouds-project:2.3.0-SNAPSHOT, <https://builds.apache.org/job/jclouds-with-credentials/job/jclouds-packet-live-tests/ws/project/pom.xml,>
line 1196, column 15
[WARNING] 
[WARNING] Some problems were encountered while building the effective model for org.apache.jclouds:jclouds:pom:2.3.0-SNAPSHOT
[WARNING] 'build.pluginManagement.plugins.plugin.(groupId:artifactId)' must be unique but
found duplicate declaration of plugin org.apache.rat:apache-rat-plugin @ org.apache.jclouds:jclouds-project:2.3.0-SNAPSHOT,
<https://builds.apache.org/job/jclouds-with-credentials/job/jclouds-packet-live-tests/ws/project/pom.xml,>
line 997, column 17
[WARNING] 'reporting.plugins.plugin.version' for org.apache.maven.plugins:maven-checkstyle-plugin
is missing. @ org.apache.jclouds:jclouds-project:2.3.0-SNAPSHOT, <https://builds.apache.org/job/jclouds-with-credentials/job/jclouds-packet-live-tests/ws/project/pom.xml,>
line 1196, column 15
[WARNING] 
[WARNING] It is highly recommended to fix these problems because they threaten the stability
of your build.
[WARNING] 
[WARNING] For this reason, future Maven versions might no longer support building such malformed
projects.
[WARNING] 
[INFO] 
[INFO] -----------------< org.apache.jclouds.provider:packet >-----------------
[INFO] Building jclouds Packet compute API 2.3.0-SNAPSHOT
[INFO] -------------------------------[ bundle ]-------------------------------
Downloading: https://repository.apache.org/content/repositories/snapshots/org/apache/jclouds/jclouds-compute/2.3.0-SNAPSHOT/maven-metadata.xml
Downloading: http://repository.apache.org/snapshots/org/apache/jclouds/jclouds-compute/2.3.0-SNAPSHOT/maven-metadata.xml
Downloaded: http://repository.apache.org/snapshots/org/apache/jclouds/jclouds-compute/2.3.0-SNAPSHOT/maven-metadata.xml
(2 KB at 2.6 KB/sec)
Downloaded: https://repository.apache.org/content/repositories/snapshots/org/apache/jclouds/jclouds-compute/2.3.0-SNAPSHOT/maven-metadata.xml
(2 KB at 1.3 KB/sec)
Downloading: https://repository.apache.org/content/repositories/snapshots/org/apache/jclouds/jclouds-compute/2.3.0-SNAPSHOT/jclouds-compute-2.3.0-20200422.084346-19.pom
Downloaded: https://repository.apache.org/content/repositories/snapshots/org/apache/jclouds/jclouds-compute/2.3.0-SNAPSHOT/jclouds-compute-2.3.0-20200422.084346-19.pom
(3 KB at 3.4 KB/sec)
Downloading: http://repository.apache.org/snapshots/org/apache/jclouds/jclouds-scriptbuilder/2.3.0-SNAPSHOT/maven-metadata.xml
Downloading: https://repository.apache.org/content/repositories/snapshots/org/apache/jclouds/jclouds-scriptbuilder/2.3.0-SNAPSHOT/maven-metadata.xml
Downloaded: http://repository.apache.org/snapshots/org/apache/jclouds/jclouds-scriptbuilder/2.3.0-SNAPSHOT/maven-metadata.xml
(2 KB at 4.9 KB/sec)
Downloaded: https://repository.apache.org/content/repositories/snapshots/org/apache/jclouds/jclouds-scriptbuilder/2.3.0-SNAPSHOT/maven-metadata.xml
(2 KB at 2.0 KB/sec)
Downloading: https://repository.apache.org/content/repositories/snapshots/org/apache/jclouds/jclouds-scriptbuilder/2.3.0-SNAPSHOT/jclouds-scriptbuilder-2.3.0-20200422.084225-19.pom
Downloaded: https://repository.apache.org/content/repositories/snapshots/org/apache/jclouds/jclouds-scriptbuilder/2.3.0-SNAPSHOT/jclouds-scriptbuilder-2.3.0-20200422.084225-19.pom
(3 KB at 3.4 KB/sec)
Downloading: http://repository.apache.org/snapshots/org/apache/jclouds/jclouds-core/2.3.0-SNAPSHOT/maven-metadata.xml
Downloading: https://repository.apache.org/content/repositories/snapshots/org/apache/jclouds/jclouds-core/2.3.0-SNAPSHOT/maven-metadata.xml
Downloaded: http://repository.apache.org/snapshots/org/apache/jclouds/jclouds-core/2.3.0-SNAPSHOT/maven-metadata.xml
(2 KB at 4.5 KB/sec)
Downloaded: https://repository.apache.org/content/repositories/snapshots/org/apache/jclouds/jclouds-core/2.3.0-SNAPSHOT/maven-metadata.xml
(2 KB at 1.7 KB/sec)
Downloading: https://repository.apache.org/content/repositories/snapshots/org/apache/jclouds/jclouds-core/2.3.0-SNAPSHOT/jclouds-core-2.3.0-20200422.083851-19.pom
Downloaded: https://repository.apache.org/content/repositories/snapshots/org/apache/jclouds/jclouds-core/2.3.0-SNAPSHOT/jclouds-core-2.3.0-20200422.083851-19.pom
(6 KB at 5.2 KB/sec)
Downloading: http://repository.apache.org/snapshots/org/apache/jclouds/jclouds-gson/2.3.0-SNAPSHOT/maven-metadata.xml
Downloading: https://repository.apache.org/content/repositories/snapshots/org/apache/jclouds/jclouds-gson/2.3.0-SNAPSHOT/maven-metadata.xml
Downloaded: http://repository.apache.org/snapshots/org/apache/jclouds/jclouds-gson/2.3.0-SNAPSHOT/maven-metadata.xml
(2 KB at 4.2 KB/sec)
Downloaded: https://repository.apache.org/content/repositories/snapshots/org/apache/jclouds/jclouds-gson/2.3.0-SNAPSHOT/maven-metadata.xml
(2 KB at 1.7 KB/sec)
Downloading: https://repository.apache.org/content/repositories/snapshots/org/apache/jclouds/jclouds-gson/2.3.0-SNAPSHOT/jclouds-gson-2.3.0-20200422.083523-22.pom
Downloaded: https://repository.apache.org/content/repositories/snapshots/org/apache/jclouds/jclouds-gson/2.3.0-SNAPSHOT/jclouds-gson-2.3.0-20200422.083523-22.pom
(2 KB at 2.4 KB/sec)
Downloading: https://repository.apache.org/content/repositories/snapshots/org/apache/jclouds/driver/jclouds-slf4j/2.3.0-SNAPSHOT/maven-metadata.xml
Downloading: http://repository.apache.org/snapshots/org/apache/jclouds/driver/jclouds-slf4j/2.3.0-SNAPSHOT/maven-metadata.xml
Downloaded: http://repository.apache.org/snapshots/org/apache/jclouds/driver/jclouds-slf4j/2.3.0-SNAPSHOT/maven-metadata.xml
(2 KB at 4.4 KB/sec)
Downloaded: https://repository.apache.org/content/repositories/snapshots/org/apache/jclouds/driver/jclouds-slf4j/2.3.0-SNAPSHOT/maven-metadata.xml
(2 KB at 2.0 KB/sec)
Downloading: https://repository.apache.org/content/repositories/snapshots/org/apache/jclouds/driver/jclouds-slf4j/2.3.0-SNAPSHOT/jclouds-slf4j-2.3.0-20200422.083925-19.pom
Downloaded: https://repository.apache.org/content/repositories/snapshots/org/apache/jclouds/driver/jclouds-slf4j/2.3.0-SNAPSHOT/jclouds-slf4j-2.3.0-20200422.083925-19.pom
(3 KB at 3.1 KB/sec)
Downloading: http://repository.apache.org/snapshots/org/apache/jclouds/driver/jclouds-sshj/2.3.0-SNAPSHOT/maven-metadata.xml
Downloading: https://repository.apache.org/content/repositories/snapshots/org/apache/jclouds/driver/jclouds-sshj/2.3.0-SNAPSHOT/maven-metadata.xml
Downloaded: http://repository.apache.org/snapshots/org/apache/jclouds/driver/jclouds-sshj/2.3.0-SNAPSHOT/maven-metadata.xml
(2 KB at 5.1 KB/sec)
Downloaded: https://repository.apache.org/content/repositories/snapshots/org/apache/jclouds/driver/jclouds-sshj/2.3.0-SNAPSHOT/maven-metadata.xml
(2 KB at 2.0 KB/sec)
Downloading: https://repository.apache.org/content/repositories/snapshots/org/apache/jclouds/driver/jclouds-sshj/2.3.0-SNAPSHOT/jclouds-sshj-2.3.0-20200422.084749-18.pom
Downloaded: https://repository.apache.org/content/repositories/snapshots/org/apache/jclouds/driver/jclouds-sshj/2.3.0-SNAPSHOT/jclouds-sshj-2.3.0-20200422.084749-18.pom
(6 KB at 6.1 KB/sec)
Downloading: https://repository.apache.org/content/repositories/snapshots/org/apache/jclouds/driver/jclouds-bouncycastle/2.3.0-SNAPSHOT/maven-metadata.xml
Downloading: http://repository.apache.org/snapshots/org/apache/jclouds/driver/jclouds-bouncycastle/2.3.0-SNAPSHOT/maven-metadata.xml
Downloaded: http://repository.apache.org/snapshots/org/apache/jclouds/driver/jclouds-bouncycastle/2.3.0-SNAPSHOT/maven-metadata.xml
(2 KB at 5.1 KB/sec)
Downloaded: https://repository.apache.org/content/repositories/snapshots/org/apache/jclouds/driver/jclouds-bouncycastle/2.3.0-SNAPSHOT/maven-metadata.xml
(2 KB at 2.0 KB/sec)
Downloading: https://repository.apache.org/content/repositories/snapshots/org/apache/jclouds/driver/jclouds-bouncycastle/2.3.0-SNAPSHOT/jclouds-bouncycastle-2.3.0-20200422.084714-18.pom
Downloaded: https://repository.apache.org/content/repositories/snapshots/org/apache/jclouds/driver/jclouds-bouncycastle/2.3.0-SNAPSHOT/jclouds-bouncycastle-2.3.0-20200422.084714-18.pom
(3 KB at 2.8 KB/sec)
Downloading: https://repository.apache.org/content/repositories/snapshots/org/apache/jclouds/jclouds-compute/2.3.0-SNAPSHOT/jclouds-compute-2.3.0-20200422.084346-19.jar
Downloading: https://repository.apache.org/content/repositories/snapshots/org/apache/jclouds/jclouds-scriptbuilder/2.3.0-SNAPSHOT/jclouds-scriptbuilder-2.3.0-20200422.084225-19.jar
Downloading: https://repository.apache.org/content/repositories/snapshots/org/apache/jclouds/jclouds-core/2.3.0-SNAPSHOT/jclouds-core-2.3.0-20200422.083851-19.jar
Downloading: https://repository.apache.org/content/repositories/snapshots/org/apache/jclouds/jclouds-core/2.3.0-SNAPSHOT/jclouds-core-2.3.0-20200422.083851-19-tests.jar
Downloading: https://repository.apache.org/content/repositories/snapshots/org/apache/jclouds/jclouds-gson/2.3.0-SNAPSHOT/jclouds-gson-2.3.0-20200422.083523-22.jar
Downloaded: https://repository.apache.org/content/repositories/snapshots/org/apache/jclouds/jclouds-gson/2.3.0-SNAPSHOT/jclouds-gson-2.3.0-20200422.083523-22.jar
(248 KB at 220.4 KB/sec)
Downloading: https://repository.apache.org/content/repositories/snapshots/org/apache/jclouds/jclouds-compute/2.3.0-SNAPSHOT/jclouds-compute-2.3.0-20200422.084346-19-tests.jar
Downloaded: https://repository.apache.org/content/repositories/snapshots/org/apache/jclouds/jclouds-scriptbuilder/2.3.0-SNAPSHOT/jclouds-scriptbuilder-2.3.0-20200422.084225-19.jar
(170 KB at 146.3 KB/sec)
Downloading: https://repository.apache.org/content/repositories/snapshots/org/apache/jclouds/driver/jclouds-slf4j/2.3.0-SNAPSHOT/jclouds-slf4j-2.3.0-20200422.083925-19-tests.jar
Downloaded: https://repository.apache.org/content/repositories/snapshots/org/apache/jclouds/jclouds-core/2.3.0-SNAPSHOT/jclouds-core-2.3.0-20200422.083851-19-tests.jar
(601 KB at 483.0 KB/sec)
Downloading: https://repository.apache.org/content/repositories/snapshots/org/apache/jclouds/driver/jclouds-slf4j/2.3.0-SNAPSHOT/jclouds-slf4j-2.3.0-20200422.083925-19.jar
Downloaded: https://repository.apache.org/content/repositories/snapshots/org/apache/jclouds/jclouds-compute/2.3.0-SNAPSHOT/jclouds-compute-2.3.0-20200422.084346-19.jar
(511 KB at 409.6 KB/sec)
Downloading: https://repository.apache.org/content/repositories/snapshots/org/apache/jclouds/driver/jclouds-sshj/2.3.0-SNAPSHOT/jclouds-sshj-2.3.0-20200422.084749-18.jar
Downloaded: https://repository.apache.org/content/repositories/snapshots/org/apache/jclouds/jclouds-core/2.3.0-SNAPSHOT/jclouds-core-2.3.0-20200422.083851-19.jar
(740 KB at 582.8 KB/sec)
Downloading: https://repository.apache.org/content/repositories/snapshots/org/apache/jclouds/driver/jclouds-bouncycastle/2.3.0-SNAPSHOT/jclouds-bouncycastle-2.3.0-20200422.084714-18.jar
Downloaded: https://repository.apache.org/content/repositories/snapshots/org/apache/jclouds/driver/jclouds-slf4j/2.3.0-SNAPSHOT/jclouds-slf4j-2.3.0-20200422.083925-19-tests.jar
(10 KB at 12.3 KB/sec)
Downloaded: https://repository.apache.org/content/repositories/snapshots/org/apache/jclouds/driver/jclouds-slf4j/2.3.0-SNAPSHOT/jclouds-slf4j-2.3.0-20200422.083925-19.jar
(12 KB at 14.1 KB/sec)
Downloaded: https://repository.apache.org/content/repositories/snapshots/org/apache/jclouds/driver/jclouds-bouncycastle/2.3.0-SNAPSHOT/jclouds-bouncycastle-2.3.0-20200422.084714-18.jar
(11 KB at 12.7 KB/sec)
Downloaded: https://repository.apache.org/content/repositories/snapshots/org/apache/jclouds/driver/jclouds-sshj/2.3.0-SNAPSHOT/jclouds-sshj-2.3.0-20200422.084749-18.jar
(39 KB at 43.5 KB/sec)
Downloaded: https://repository.apache.org/content/repositories/snapshots/org/apache/jclouds/jclouds-compute/2.3.0-SNAPSHOT/jclouds-compute-2.3.0-20200422.084346-19-tests.jar
(235 KB at 212.3 KB/sec)
[INFO] 
[INFO] --- maven-clean-plugin:2.5:clean (default-clean) @ packet ---
[INFO] Deleting <https://builds.apache.org/job/jclouds-with-credentials/job/jclouds-packet-live-tests/ws/providers/packet/target>
[INFO] 
[INFO] --- maven-enforcer-plugin:1.1.1:enforce (enforce-banned-dependencies) @ packet ---
[INFO] 
[INFO] --- maven-enforcer-plugin:1.1.1:enforce (enforce-java) @ packet ---
[INFO] 
[INFO] --- maven-toolchains-plugin:1.1:toolchain (default) @ packet ---
[INFO] Required toolchain: jdk [ version='1.7' ]
[INFO] Found matching toolchain for type jdk: JDK[/home/jenkins/tools/java/latest1.7/]
[INFO] 
[INFO] --- maven-remote-resources-plugin:1.5:process (default) @ packet ---
[INFO] 
[INFO] --- maven-resources-plugin:2.6:resources (default-resources) @ packet ---
[INFO] Using 'UTF-8' encoding to copy filtered resources.
[INFO] skip non existing resourceDirectory <https://builds.apache.org/job/jclouds-with-credentials/job/jclouds-packet-live-tests/ws/providers/packet/src/main/resources>
[INFO] skip non existing resourceDirectory <https://builds.apache.org/job/jclouds-with-credentials/job/jclouds-packet-live-tests/ws/providers/packet/target/classes>
[INFO] Copying 3 resources
[INFO] 
[INFO] --- maven-compiler-plugin:3.8.0:compile (default-compile) @ packet ---
[INFO] Toolchain in maven-compiler-plugin: JDK[/home/jenkins/tools/java/latest1.7/]
[INFO] Changes detected - recompiling the module!
[INFO] Compiling 39 source files to <https://builds.apache.org/job/jclouds-with-credentials/job/jclouds-packet-live-tests/ws/providers/packet/target/classes>
[JENKINS] Archiving disabled
[INFO] ------------------------------------------------------------------------
[INFO] BUILD FAILURE
[INFO] ------------------------------------------------------------------------
[INFO] Total time: 04:35 min
[INFO] Finished at: 2020-04-28T05:06:34Z
[INFO] ------------------------------------------------------------------------
[JENKINS] Archiving disabled
[ERROR] Failed to execute goal org.apache.maven.plugins:maven-compiler-plugin:3.8.0:compile
(default-compile) on project packet: Fatal error compiling: CompilerException: InvocationTargetException:
NullPointerException -> [Help 1]
[ERROR] 
[ERROR] To see the full stack trace of the errors, re-run Maven with the -e switch.
[ERROR] Re-run Maven using the -X switch to enable full debug logging.
[ERROR] 
[ERROR] For more information about the errors and possible solutions, please read the following
articles:
[ERROR] [Help 1] http://cwiki.apache.org/confluence/display/MAVEN/MojoExecutionException
channel stopped
No JDK named ?JDK 1.8.0_144 (unlimited security)? found
No JDK named ?JDK 1.8.0_144 (unlimited security)? found
No JDK named ?JDK 1.8.0_144 (unlimited security)? found

Mime
View raw message