jmeter-dev mailing list archives

Site index · List index
Message view « Date » · « Thread »
Top « Date » · « Thread »
From Apache Jenkins Server <jenk...@builds.apache.org>
Subject Build failed in Jenkins: JMeter-trunk #3936
Date Tue, 19 Aug 2014 15:02:34 GMT
See <https://builds.apache.org/job/JMeter-trunk/3936/changes>

Changes:

[sebb] Allow access to Request Headers in Regex Extractor
 Update changes.xml based on feedback from Philippe M
Bugzilla Id: 52061

[sebb] Log currently unused

[sebb] Update to use non-deprecated method

[sebb] Update to use non-deprecated method

[sebb] Update XStream to 1.4.7

------------------------------------------
[...truncated 881 lines...]
   [anakia] Input:  usermanual/index.xml
   [anakia] Output: /x1/jenkins/jenkins-slave/workspace/JMeter-trunk/trunk/printable_docs/usermanual/index.html
   [anakia] Input:  usermanual/intro.xml
   [anakia] Output: /x1/jenkins/jenkins-slave/workspace/JMeter-trunk/trunk/printable_docs/usermanual/intro.html
   [anakia] Input:  usermanual/ldapanswer_xml.xml
   [anakia] Output: /x1/jenkins/jenkins-slave/workspace/JMeter-trunk/trunk/printable_docs/usermanual/ldapanswer_xml.html
   [anakia] Input:  usermanual/ldapops_tutor.xml
   [anakia] Output: /x1/jenkins/jenkins-slave/workspace/JMeter-trunk/trunk/printable_docs/usermanual/ldapops_tutor.html
   [anakia] Input:  usermanual/listeners.xml
   [anakia] Output: /x1/jenkins/jenkins-slave/workspace/JMeter-trunk/trunk/printable_docs/usermanual/listeners.html
   [anakia] Input:  usermanual/regular_expressions.xml
   [anakia] Output: /x1/jenkins/jenkins-slave/workspace/JMeter-trunk/trunk/printable_docs/usermanual/regular_expressions.html
   [anakia] Input:  usermanual/remote-test.xml
   [anakia] Output: /x1/jenkins/jenkins-slave/workspace/JMeter-trunk/trunk/printable_docs/usermanual/remote-test.html
   [anakia] Input:  usermanual/test_plan.xml
   [anakia] Output: /x1/jenkins/jenkins-slave/workspace/JMeter-trunk/trunk/printable_docs/usermanual/test_plan.html
     [echo] Fixing EOL
     [echo] Removing unnecessary </br> tags
     [echo] Copying files
     [copy] Copying 16 files to /x1/jenkins/jenkins-slave/workspace/JMeter-trunk/trunk/printable_docs/demos
     [copy] Copying 5 files to /x1/jenkins/jenkins-slave/workspace/JMeter-trunk/trunk/printable_docs/usermanual
     [copy] Copying 1 file to /x1/jenkins/jenkins-slave/workspace/JMeter-trunk/trunk/printable_docs/extending

pack-nightly:

_pack-binaries:
      [tar] Building tar: /x1/jenkins/jenkins-slave/workspace/JMeter-trunk/trunk/dist/apache-jmeter-r1618608_bin.tar
     [gzip] Building: /x1/jenkins/jenkins-slave/workspace/JMeter-trunk/trunk/dist/apache-jmeter-r1618608_bin.tgz
   [delete] Deleting: /x1/jenkins/jenkins-slave/workspace/JMeter-trunk/trunk/dist/apache-jmeter-r1618608_bin.tar
      [zip] Building zip: /x1/jenkins/jenkins-slave/workspace/JMeter-trunk/trunk/dist/apache-jmeter-r1618608_bin.zip

_pack-libraries:
      [tar] Building tar: /x1/jenkins/jenkins-slave/workspace/JMeter-trunk/trunk/dist/apache-jmeter-r1618608_lib.tar
     [gzip] Building: /x1/jenkins/jenkins-slave/workspace/JMeter-trunk/trunk/dist/apache-jmeter-r1618608_lib.tgz
   [delete] Deleting: /x1/jenkins/jenkins-slave/workspace/JMeter-trunk/trunk/dist/apache-jmeter-r1618608_lib.tar
      [zip] Building zip: /x1/jenkins/jenkins-slave/workspace/JMeter-trunk/trunk/dist/apache-jmeter-r1618608_lib.zip

_pack-source:
      [tar] Building tar: /x1/jenkins/jenkins-slave/workspace/JMeter-trunk/trunk/dist/apache-jmeter-r1618608_src.tar
     [gzip] Building: /x1/jenkins/jenkins-slave/workspace/JMeter-trunk/trunk/dist/apache-jmeter-r1618608_src.tgz
   [delete] Deleting: /x1/jenkins/jenkins-slave/workspace/JMeter-trunk/trunk/dist/apache-jmeter-r1618608_src.tar
      [zip] Building zip: /x1/jenkins/jenkins-slave/workspace/JMeter-trunk/trunk/dist/apache-jmeter-r1618608_src.zip

nightly:

compile-tests:
    [javac] Compiling 101 source files to /x1/jenkins/jenkins-slave/workspace/JMeter-trunk/trunk/build/test

_test:
     [echo] 
     [echo]    gump.run = false
     [echo]    java.awt.headless = true
     [echo]    test.headless = true
     [echo]    user.dir = /x1/jenkins/jenkins-slave/workspace/JMeter-trunk/trunk
     [echo]    basedir = /x1/jenkins/jenkins-slave/workspace/JMeter-trunk/trunk
     [echo]    test dir = build/test
     [echo]    test dir gump = build/test
     [echo]    testsaveservice.saveout = ${testsaveservice.saveout}
     [echo]    test.encoding = UTF-8
     [echo]    
     [java] Setting JMeterHome: /x1/jenkins/jenkins-slave/workspace/JMeter-trunk/trunk
     [java] Setting up logging props using file: /x1/jenkins/jenkins-slave/workspace/JMeter-trunk/trunk/bin/testfiles/jmetertest.properties
     [java] Using initializeProperties() from org.apache.jmeter.util.JMeterUtils
     [java] Setting up initial properties using: /x1/jenkins/jenkins-slave/workspace/JMeter-trunk/trunk/bin/testfiles/jmetertest.properties
     [java] Initializing Properties: /x1/jenkins/jenkins-slave/workspace/JMeter-trunk/trunk/bin/testfiles/jmetertest.properties
     [java] JMeterVersion=r1618608
     [java] java.version=1.6.0_45
     [java] java.home=/x1/jenkins/jenkins-slave/tools/hudson.model.JDK/jdk-1.6u45/jre
     [java] file.encoding=UTF-8
     [java] default encoding=UTF-8
     [java] user.dir=/x1/jenkins/jenkins-slave/workspace/JMeter-trunk/trunk/bin
     [java] Locale=en_US
     [java] os.name=Linux
     [java] os.version=3.2.0-67-generic
     [java] +++++++++++
     [java] java.awt.headless=true
     [java] java.awt.graphicsenv=sun.awt.X11GraphicsEnvironment
     [java] ------------
     [java] Creating test suite
     [java] Scanning build/test for test cases
     [java] ClassFinder found: 90 TestCase classes
     [java] o.a.j.junit.JMeterTest Error creating org.apache.jmeter.assertions.gui.BeanShellAssertionGui
java.awt.HeadlessException
     [java] o.a.j.junit.JMeterTest Error creating org.apache.jmeter.assertions.gui.XPathAssertionGui
java.awt.HeadlessException
     [java] o.a.j.junit.JMeterTest Error creating org.apache.jmeter.protocol.http.control.gui.AjpSamplerGui
java.awt.HeadlessException
     [java] o.a.j.junit.JMeterTest Error creating org.apache.jmeter.protocol.http.control.gui.HttpTestSampleGui
java.awt.HeadlessException
     [java] o.a.j.junit.JMeterTest Error creating org.apache.jmeter.protocol.java.control.gui.BeanShellSamplerGui
java.awt.HeadlessException
     [java] o.a.j.junit.JMeterTest Error creating org.apache.jmeter.protocol.jms.control.gui.JMSPublisherGui
java.awt.HeadlessException
     [java] o.a.j.junit.JMeterTest Error creating org.apache.jmeter.protocol.jms.control.gui.JMSSamplerGui
java.awt.HeadlessException
     [java] o.a.j.junit.JMeterTest Error creating org.apache.jmeter.protocol.tcp.config.gui.TCPConfigGui
java.awt.HeadlessException
     [java] o.a.j.junit.JMeterTest Error creating org.apache.jmeter.protocol.tcp.control.gui.TCPSamplerGui
java.awt.HeadlessException
     [java] Last class=org.apache.jmeter.visualizers.ViewResultsFullVisualizer
     [java] objects.size=99
     [java] Last error=java.awt.HeadlessException
     [java] ERROR: (see logfile) could not add test for class org.apache.jmeter.junit.JMeterTest
java.lang.reflect.InvocationTargetException
     [java] 	at sun.reflect.NativeMethodAccessorImpl.invoke0(Native Method)
     [java] 	at sun.reflect.NativeMethodAccessorImpl.invoke(NativeMethodAccessorImpl.java:39)
     [java] 	at sun.reflect.DelegatingMethodAccessorImpl.invoke(DelegatingMethodAccessorImpl.java:25)
     [java] 	at java.lang.reflect.Method.invoke(Method.java:597)
     [java] 	at org.apache.jorphan.test.AllTests.suite(AllTests.java:356)
     [java] 	at org.apache.jorphan.test.AllTests.main(AllTests.java:213)
     [java] Caused by: java.lang.ExceptionInInitializerError
     [java] 	at org.apache.jmeter.visualizers.SearchTextExtension.createSearchTextPanel(SearchTextExtension.java:208)
     [java] 	at org.apache.jmeter.visualizers.SearchTextExtension.createSearchTextExtensionPane(SearchTextExtension.java:220)
     [java] 	at org.apache.jmeter.visualizers.SamplerResultTab.createResponseDataPanel(SamplerResultTab.java:462)
     [java] 	at org.apache.jmeter.visualizers.SamplerResultTab.init(SamplerResultTab.java:208)
     [java] 	at org.apache.jmeter.visualizers.ViewResultsFullVisualizer.init(ViewResultsFullVisualizer.java:235)
     [java] 	at org.apache.jmeter.visualizers.ViewResultsFullVisualizer.<init>(ViewResultsFullVisualizer.java:128)
     [java] 	at sun.reflect.NativeConstructorAccessorImpl.newInstance0(Native Method)
     [java] 	at sun.reflect.NativeConstructorAccessorImpl.newInstance(NativeConstructorAccessorImpl.java:39)
     [java] 	at sun.reflect.DelegatingConstructorAccessorImpl.newInstance(DelegatingConstructorAccessorImpl.java:27)
     [java] 	at java.lang.reflect.Constructor.newInstance(Constructor.java:513)
     [java] 	at java.lang.Class.newInstance0(Class.java:357)
     [java] 	at java.lang.Class.newInstance(Class.java:310)
     [java] 	at org.apache.jmeter.junit.JMeterTest.getObjects(JMeterTest.java:578)
     [java] 	at org.apache.jmeter.junit.JMeterTest.suiteGUIComponents(JMeterTest.java:279)
     [java] 	at org.apache.jmeter.junit.JMeterTest.suite(JMeterTest.java:141)
     [java] 	... 6 more
     [java] Caused by: java.awt.HeadlessException
     [java] 	at sun.awt.HeadlessToolkit.getMenuShortcutKeyMask(HeadlessToolkit.java:213)
     [java] 	at org.apache.jmeter.gui.action.KeyStrokes.<clinit>(KeyStrokes.java:37)
     [java] 	... 21 more
     [java] 
     [java] Created: 89 tests including 7 suites
     [java] Starting test run, test count = 1560
     [java] .........................................
     [java] .........................................
     [java] .........................................
     [java] .........................................
     [java] .........................................
     [java] .........................................
     [java] .........................................
     [java] .........................................
     [java] .........................................
     [java] ..............................Skipping test:org.apache.jmeter.protocol.http.control.gui.TestHttpTestSampleGui,
cannot run in Headless mode
     [java] Skipping test:org.apache.jmeter.protocol.http.control.gui.TestHttpTestSampleGui#testCloneSampler,
cannot run in Headless mode
     [java] ...........
     [java] .........................................
     [java] .........................................
     [java] .........................................
     [java] ...............................o.a.j.junit.JMeterTest Error running testConfiguring
due to Headless mode, java.awt.HeadlessException
     [java] ..........
     [java] .........................................
     [java] .........................................
     [java] .........................................
     [java] .........................................
     [java] .........................................
     [java] .........................................
     [java] .........................................
     [java] .........................................
     [java] .........................................
     [java] .........................................
     [java] .........................................
     [java] .........................................
     [java] .........................................
     [java] .........................................
     [java] .........................................
     [java] .........................................
     [java] .........................................
     [java] .........................................
     [java] .........................................
     [java] .........................................
     [java] .........................................
     [java] .........................................
     [java] .........................................
     [java] .........................................
     [java] ..
     [java] Time: 59.966
     [java] 
     [java] OK (1560 tests)
     [java] 

batchtest:
     [echo] Starting BatchTestLocal using -X
   [jmeter] Creating summariser <summary>
   [jmeter] Created the tree successfully using testfiles/BatchTestLocal.jmx
   [jmeter] Starting the test @ Tue Aug 19 15:01:29 UTC 2014 (1408460489224)
   [jmeter] Waiting for possible shutdown message on port 4445
   [jmeter] summary +      1 in   0.2s =    5.9/s Avg:   170 Min:   170 Max:   170 Err:  
  0 (0.00%) Active: 1 Started: 1 Finished: 0
   [jmeter] summary +     89 in  29.1s =    3.1/s Avg:   241 Min:   103 Max:   351 Err:  
 12 (13.48%) Active: 1 Started: 2 Finished: 1
   [jmeter] summary =     90 in  29.3s =    3.1/s Avg:   240 Min:   103 Max:   351 Err:  
 12 (13.33%)
   [jmeter] summary +     43 in   9.3s =    4.6/s Avg:   213 Min:     1 Max:  1110 Err:  
  4 (9.30%) Active: 0 Started: 1 Finished: 1
   [jmeter] summary =    133 in    39s =    3.4/s Avg:   231 Min:     1 Max:  1110 Err:  
 16 (12.03%)
   [jmeter] Tidying up ...    @ Tue Aug 19 15:02:09 UTC 2014 (1408460529279)
   [jmeter] ... end of run
     [echo] BatchTestLocal output files compared OK

batchtestserver:

batchtest:
     [echo] Starting BatchTestLocal using -Rlocalhost:10210
   [client] Creating summariser <summary>
   [client] Created the tree successfully using testfiles/BatchTestLocal.jmx
   [client] Configuring remote engine for localhost:10210
   [server] Created remote object: UnicastServerRef [liveRef: [endpoint:[140.211.11.27:57605](local),objID:[53d0b32d:147eeca2769:-7fff,
5132438769206609121]]]
   [client] Failed to configure localhost:10210
   [client] No remote engines were started.
   [client] Failure connecting to remote host: localhost:10210 java.rmi.ConnectException:
Connection refused to host: localhost; nested exception is: 
   [client] 	java.net.ConnectException: Connection refused
   [concat] 2014/08/19 15:02:13 FATAL - jmeter.JMeter: Failure connecting to remote host:
localhost:10210 java.rmi.ConnectException: Connection refused to host: localhost; nested exception
is: 
   [concat] 	java.net.ConnectException: Connection refused
   [concat] 	at sun.rmi.transport.tcp.TCPEndpoint.newSocket(TCPEndpoint.java:601)
   [concat] 	at sun.rmi.transport.tcp.TCPChannel.createConnection(TCPChannel.java:198)
   [concat] 	at sun.rmi.transport.tcp.TCPChannel.newConnection(TCPChannel.java:184)
   [concat] 	at sun.rmi.server.UnicastRef.newCall(UnicastRef.java:322)
   [concat] 	at sun.rmi.registry.RegistryImpl_Stub.lookup(Unknown Source)
   [concat] 	at java.rmi.Naming.lookup(Naming.java:84)
   [concat] 	at org.apache.jmeter.engine.ClientJMeterEngine.getEngine(ClientJMeterEngine.java:54)
   [concat] 	at org.apache.jmeter.engine.ClientJMeterEngine.<init>(ClientJMeterEngine.java:67)
   [concat] 	at org.apache.jmeter.JMeter.doRemoteInit(JMeter.java:926)
   [concat] 	at org.apache.jmeter.JMeter.runNonGui(JMeter.java:810)
   [concat] 	at org.apache.jmeter.JMeter.startNonGui(JMeter.java:732)
   [concat] 	at org.apache.jmeter.JMeter.start(JMeter.java:390)
   [concat] 	at sun.reflect.NativeMethodAccessorImpl.invoke0(Native Method)
   [concat] 	at sun.reflect.NativeMethodAccessorImpl.invoke(NativeMethodAccessorImpl.java:39)
   [concat] 	at sun.reflect.DelegatingMethodAccessorImpl.invoke(DelegatingMethodAccessorImpl.java:25)
   [concat] 	at java.lang.reflect.Method.invoke(Method.java:597)
   [concat] 	at org.apache.jmeter.NewDriver.main(NewDriver.java:259)
   [concat] Caused by: java.net.ConnectException: Connection refused
   [concat] 	at java.net.PlainSocketImpl.socketConnect(Native Method)
   [concat] 	at java.net.PlainSocketImpl.doConnect(PlainSocketImpl.java:351)
   [concat] 	at java.net.PlainSocketImpl.connectToAddress(PlainSocketImpl.java:213)
   [concat] 	at java.net.PlainSocketImpl.connect(PlainSocketImpl.java:200)
   [concat] 	at java.net.SocksSocketImpl.connect(SocksSocketImpl.java:366)
   [concat] 	at java.net.Socket.connect(Socket.java:529)
   [concat] 	at java.net.Socket.connect(Socket.java:478)
   [concat] 	at java.net.Socket.<init>(Socket.java:375)
   [concat] 	at java.net.Socket.<init>(Socket.java:189)
   [concat] 	at sun.rmi.transport.proxy.RMIDirectSocketFactory.createSocket(RMIDirectSocketFactory.java:22)
   [concat] 	at sun.rmi.transport.proxy.RMIMasterSocketFactory.createSocket(RMIMasterSocketFactory.java:128)
   [concat] 	at sun.rmi.transport.tcp.TCPEndpoint.newSocket(TCPEndpoint.java:595)
   [concat] 	... 16 more
   [concat] 

BUILD FAILED
/x1/jenkins/jenkins-slave/workspace/JMeter-trunk/trunk/build.xml:2451: The following error
occurred while executing this line:
/x1/jenkins/jenkins-slave/workspace/JMeter-trunk/trunk/build.xml:2556: The following error
occurred while executing this line:
/x1/jenkins/jenkins-slave/workspace/JMeter-trunk/trunk/build.xml:2518: Cannot find output
file /x1/jenkins/jenkins-slave/workspace/JMeter-trunk/trunk/bin/BatchTestLocal.csv

Total time: 3 minutes 14 seconds
Build step 'Invoke Ant' marked build as failure
[locks-and-latches] Releasing all the locks
[locks-and-latches] All the locks released
Archiving artifacts
Sending artifact delta relative to JMeter-trunk #3934
Archived 6 artifacts
Archive block size is 32768
Received 582 blocks and 60052690 bytes
Compression is 24.1%
Took 19 sec

Mime
View raw message