jmeter-dev mailing list archives

Site index · List index
Message view « Date » · « Thread »
Top « Date » · « Thread »
From Apache Jenkins Server <jenk...@builds.apache.org>
Subject Build failed in Jenkins: JMeter-trunk #4858
Date Tue, 29 Dec 2015 12:01:21 GMT
See <https://builds.apache.org/job/JMeter-trunk/4858/changes>

Changes:

[fschumacher] No need to compare boolean to true, use boolean directly.

------------------------------------------
[...truncated 933 lines...]
     [echo] Copying files
     [copy] Copying 16 files to /x1/jenkins/jenkins-slave/workspace/JMeter-trunk/trunk/printable_docs/demos
     [copy] Copying 5 files to /x1/jenkins/jenkins-slave/workspace/JMeter-trunk/trunk/printable_docs/usermanual
     [copy] Copying 1 file to /x1/jenkins/jenkins-slave/workspace/JMeter-trunk/trunk/printable_docs/extending

pack-nightly:

_pack-binaries:
      [tar] Building tar: /x1/jenkins/jenkins-slave/workspace/JMeter-trunk/trunk/dist/apache-jmeter-r1722111_bin.tar
     [gzip] Building: /x1/jenkins/jenkins-slave/workspace/JMeter-trunk/trunk/dist/apache-jmeter-r1722111_bin.tgz
   [delete] Deleting: /x1/jenkins/jenkins-slave/workspace/JMeter-trunk/trunk/dist/apache-jmeter-r1722111_bin.tar
      [zip] Building zip: /x1/jenkins/jenkins-slave/workspace/JMeter-trunk/trunk/dist/apache-jmeter-r1722111_bin.zip

_pack-libraries:
      [tar] Building tar: /x1/jenkins/jenkins-slave/workspace/JMeter-trunk/trunk/dist/apache-jmeter-r1722111_lib.tar
     [gzip] Building: /x1/jenkins/jenkins-slave/workspace/JMeter-trunk/trunk/dist/apache-jmeter-r1722111_lib.tgz
   [delete] Deleting: /x1/jenkins/jenkins-slave/workspace/JMeter-trunk/trunk/dist/apache-jmeter-r1722111_lib.tar
      [zip] Building zip: /x1/jenkins/jenkins-slave/workspace/JMeter-trunk/trunk/dist/apache-jmeter-r1722111_lib.zip

_pack-source:
      [tar] Building tar: /x1/jenkins/jenkins-slave/workspace/JMeter-trunk/trunk/dist/apache-jmeter-r1722111_src.tar
     [gzip] Building: /x1/jenkins/jenkins-slave/workspace/JMeter-trunk/trunk/dist/apache-jmeter-r1722111_src.tgz
   [delete] Deleting: /x1/jenkins/jenkins-slave/workspace/JMeter-trunk/trunk/dist/apache-jmeter-r1722111_src.tar
      [zip] Building zip: /x1/jenkins/jenkins-slave/workspace/JMeter-trunk/trunk/dist/apache-jmeter-r1722111_src.zip

nightly:

compile-tests:
    [javac] Compiling 108 source files to /x1/jenkins/jenkins-slave/workspace/JMeter-trunk/trunk/build/test
    [javac] Note: /x1/jenkins/jenkins-slave/workspace/JMeter-trunk/trunk/test/src/org/apache/jmeter/protocol/http/control/TestCookieManager.java
uses or overrides a deprecated API.
    [javac] Note: Recompile with -Xlint:deprecation for details.

_test:
     [echo] 
     [echo]    gump.run = false
     [echo]    java.awt.headless = true
     [echo]    test.headless = true
     [echo]    user.dir = /x1/jenkins/jenkins-slave/workspace/JMeter-trunk/trunk
     [echo]    basedir = /x1/jenkins/jenkins-slave/workspace/JMeter-trunk/trunk
     [echo]    test dir = build/test
     [echo]    test dir gump = build/test
     [echo]    testsaveservice.saveout = ${testsaveservice.saveout}
     [echo]    test.encoding = UTF-8
     [echo]    
     [java] Setting JMeterHome: /x1/jenkins/jenkins-slave/workspace/JMeter-trunk/trunk
     [java] Setting up logging props using file: /x1/jenkins/jenkins-slave/workspace/JMeter-trunk/trunk/bin/testfiles/jmetertest.properties
     [java] Writing log file to:/x1/jenkins/jenkins-slave/workspace/JMeter-trunk/trunk/bin/jmeter-test.log
     [java] Using initializeProperties() from org.apache.jmeter.util.JMeterUtils
     [java] Setting up initial properties using: /x1/jenkins/jenkins-slave/workspace/JMeter-trunk/trunk/bin/testfiles/jmetertest.properties
     [java] Initializing Properties: /x1/jenkins/jenkins-slave/workspace/JMeter-trunk/trunk/bin/testfiles/jmetertest.properties
     [java] Writing log file to:/x1/jenkins/jenkins-slave/workspace/JMeter-trunk/trunk/bin/jmeter-test.log
     [java] JMeterVersion=r1722111
     [java] java.version=1.7.0_80
     [java] java.home=/x1/jenkins/jenkins-slave/tools/hudson.model.JDK/latest1.7/jre
     [java] file.encoding=UTF-8
     [java] default encoding=UTF-8
     [java] user.dir=/x1/jenkins/jenkins-slave/workspace/JMeter-trunk/trunk/bin
     [java] Locale=en_US
     [java] os.name=Linux
     [java] os.version=3.2.0-95-generic
     [java] +++++++++++
     [java] java.awt.headless=true
     [java] java.awt.graphicsenv=sun.awt.X11GraphicsEnvironment
     [java] ------------
     [java] Creating test suite
     [java] Scanning build/test for test cases
     [java] ClassFinder found: 97 TestCase classes
     [java] o.a.j.junit.JMeterTest Error creating org.apache.jmeter.assertions.gui.BeanShellAssertionGui
java.awt.HeadlessException
     [java] o.a.j.junit.JMeterTest Error creating org.apache.jmeter.assertions.gui.XPathAssertionGui
java.awt.HeadlessException
     [java] o.a.j.junit.JMeterTest Error creating org.apache.jmeter.protocol.http.control.gui.AjpSamplerGui
java.awt.HeadlessException
     [java] o.a.j.junit.JMeterTest Error creating org.apache.jmeter.protocol.http.control.gui.HttpTestSampleGui
java.awt.HeadlessException
     [java] o.a.j.junit.JMeterTest Error creating org.apache.jmeter.protocol.java.control.gui.BeanShellSamplerGui
java.awt.HeadlessException
     [java] o.a.j.junit.JMeterTest Error creating org.apache.jmeter.protocol.jms.control.gui.JMSPublisherGui
java.awt.HeadlessException
     [java] o.a.j.junit.JMeterTest Error creating org.apache.jmeter.protocol.jms.control.gui.JMSSamplerGui
java.awt.HeadlessException
     [java] o.a.j.junit.JMeterTest Error creating org.apache.jmeter.protocol.tcp.config.gui.TCPConfigGui
java.awt.HeadlessException
     [java] o.a.j.junit.JMeterTest Error creating org.apache.jmeter.protocol.tcp.control.gui.TCPSamplerGui
java.awt.HeadlessException
     [java] Last class=org.apache.jmeter.visualizers.ViewResultsFullVisualizer
     [java] objects.size=95
     [java] Last error=java.awt.HeadlessException
     [java] ERROR: (see logfile) could not add test for class org.apache.jmeter.junit.JMeterTest
java.lang.reflect.InvocationTargetException
     [java] 	at sun.reflect.NativeMethodAccessorImpl.invoke0(Native Method)
     [java] 	at sun.reflect.NativeMethodAccessorImpl.invoke(NativeMethodAccessorImpl.java:57)
     [java] 	at sun.reflect.DelegatingMethodAccessorImpl.invoke(DelegatingMethodAccessorImpl.java:43)
     [java] 	at java.lang.reflect.Method.invoke(Method.java:606)
     [java] 	at org.apache.jorphan.test.AllTests.suite(AllTests.java:359)
     [java] 	at org.apache.jorphan.test.AllTests.main(AllTests.java:213)
     [java] Caused by: java.lang.ExceptionInInitializerError
     [java] 	at org.apache.jmeter.visualizers.SearchTextExtension.createSearchTextPanel(SearchTextExtension.java:208)
     [java] 	at org.apache.jmeter.visualizers.SearchTextExtension.createSearchTextExtensionPane(SearchTextExtension.java:220)
     [java] 	at org.apache.jmeter.visualizers.SamplerResultTab.createResponseDataPanel(SamplerResultTab.java:464)
     [java] 	at org.apache.jmeter.visualizers.SamplerResultTab.init(SamplerResultTab.java:208)
     [java] 	at org.apache.jmeter.visualizers.ViewResultsFullVisualizer.init(ViewResultsFullVisualizer.java:235)
     [java] 	at org.apache.jmeter.visualizers.ViewResultsFullVisualizer.<init>(ViewResultsFullVisualizer.java:128)
     [java] 	at sun.reflect.NativeConstructorAccessorImpl.newInstance0(Native Method)
     [java] 	at sun.reflect.NativeConstructorAccessorImpl.newInstance(NativeConstructorAccessorImpl.java:57)
     [java] 	at sun.reflect.DelegatingConstructorAccessorImpl.newInstance(DelegatingConstructorAccessorImpl.java:45)
     [java] 	at java.lang.reflect.Constructor.newInstance(Constructor.java:526)
     [java] 	at java.lang.Class.newInstance(Class.java:383)
     [java] 	at org.apache.jmeter.junit.JMeterTest.getObjects(JMeterTest.java:576)
     [java] 	at org.apache.jmeter.junit.JMeterTest.suiteGUIComponents(JMeterTest.java:279)
     [java] 	at org.apache.jmeter.junit.JMeterTest.suite(JMeterTest.java:141)
     [java] 	... 6 more
     [java] Caused by: java.awt.HeadlessException
     [java] 	at sun.awt.HeadlessToolkit.getMenuShortcutKeyMask(HeadlessToolkit.java:234)
     [java] 	at org.apache.jmeter.gui.action.KeyStrokes.<clinit>(KeyStrokes.java:37)
     [java] 	... 20 more
     [java] 
     [java] Created: 96 tests including 7 suites
     [java] Starting test run, test count = 1628
     [java] .........................................
     [java] .........................................
     [java] .........................................
     [java] .........................................
     [java] .........................................
     [java] .........................................
     [java] .........................................
     [java] .........................................
     [java] .........................................
     [java] ......................................Uncomment assertEquals(0,c.size()) when
migrating to httpclient-4.5.2
     [java] ...
     [java] ...............Skipping test:org.apache.jmeter.protocol.http.control.gui.TestHttpTestSampleGui,
cannot run in Headless mode
     [java] Skipping test:org.apache.jmeter.protocol.http.control.gui.TestHttpTestSampleGui#testCloneSampler,
cannot run in Headless mode
     [java] ..........................
     [java] .........................................
     [java] .........................................
     [java] .........................................
     [java] .............................o.a.j.junit.JMeterTest Error running testConfiguring
due to Headless mode, java.awt.HeadlessException
     [java] ............
     [java] ...................Uncomment testPostRequest_FormMultipart3() when migrating to
HTTPCLIENT 4.5.2
     [java] ....Uncomment testPostRequest_FileUpload3() when migrating to HTTPCLIENT 4.5.2
     [java] ..................
     [java] .........................................
     [java] .........................................
     [java] .........................................
     [java] .........................................
     [java] .........................................
     [java] .........................................
     [java] .........................................
     [java] .........................................
     [java] .........................................
     [java] .........................................
     [java] .........................................
     [java] .........................................
     [java] .........................................
     [java] .........................................
     [java] .........................................
     [java] .........................................
     [java] .........................................
     [java] .........................................
     [java] .........................................
     [java] .........................................
     [java] .........................................
     [java] .........................................
     [java] .........................................
     [java] .............................
     [java] Time: 61.648
     [java] 
     [java] OK (1628 tests)
     [java] 

batchtest:
     [echo] Starting BatchTestLocal using -X
   [jmeter] Writing log file to:/x1/jenkins/jenkins-slave/workspace/JMeter-trunk/trunk/bin/BatchTestLocal.log
   [jmeter] Creating summariser <summary>
   [jmeter] Created the tree successfully using testfiles/BatchTestLocal.jmx
   [jmeter] Starting the test @ Tue Dec 29 12:00:20 UTC 2015 (1451390420107)
   [jmeter] Waiting for possible Shutdown/StopTestNow/Heapdump message on port 4445
   [jmeter] summary +     38 in   9.5s =    4.0/s Avg:   237 Min:   111 Max:   351 Err:  
  4 (10.53%) Active: 1 Started: 1 Finished: 0
   [jmeter] summary +     95 in  29.3s =    3.2/s Avg:   219 Min:     0 Max:   350 Err:  
 12 (12.63%) Active: 0 Started: 1 Finished: 1
   [jmeter] summary =    133 in    39s =    3.4/s Avg:   224 Min:     0 Max:   351 Err:  
 16 (12.03%)
   [jmeter] Tidying up ...    @ Tue Dec 29 12:00:59 UTC 2015 (1451390459466)
   [jmeter] ... end of run
     [echo] BatchTestLocal output files compared OK

batchtestserver:
   [server] Writing log file to:/x1/jenkins/jenkins-slave/workspace/JMeter-trunk/trunk/bin/BatchTestServer.log

batchtest:
     [echo] Starting BatchTestLocal using -Rlocalhost:10100
   [client] Writing log file to:/x1/jenkins/jenkins-slave/workspace/JMeter-trunk/trunk/bin/BatchTestLocal.log
   [client] Creating summariser <summary>
   [client] Created the tree successfully using testfiles/BatchTestLocal.jmx
   [client] Configuring remote engine: localhost:10100
   [client] Connection refused to host: localhost; nested exception is: 
   [client] 	java.net.ConnectException: Connection refused
   [client] Failed to configure localhost:10100
   [client] Stopping remote engines
   [client] Remote engines have been stopped
   [client] Error in NonGUIDriver java.lang.RuntimeException: Following remote engines could
not be configured:[localhost:10100]
   [server] Created remote object: UnicastServerRef [liveRef: [endpoint:[140.211.11.27:43019](local),objID:[35a40b42:151ed9ce371:-7fff,
3143010859345909455]]]
   [concat] 2015/12/29 12:01:03 ERROR - jmeter.engine.DistributedRunner: Failed to create
engine at localhost:10100 java.rmi.ConnectException: Connection refused to host: localhost;
nested exception is: 
   [concat] 	java.net.ConnectException: Connection refused
   [concat] 	at sun.rmi.transport.tcp.TCPEndpoint.newSocket(TCPEndpoint.java:619)
   [concat] 	at sun.rmi.transport.tcp.TCPChannel.createConnection(TCPChannel.java:216)
   [concat] 	at sun.rmi.transport.tcp.TCPChannel.newConnection(TCPChannel.java:202)
   [concat] 	at sun.rmi.server.UnicastRef.newCall(UnicastRef.java:341)
   [concat] 	at sun.rmi.registry.RegistryImpl_Stub.lookup(Unknown Source)
   [concat] 	at java.rmi.Naming.lookup(Naming.java:101)
   [concat] 	at org.apache.jmeter.engine.ClientJMeterEngine.getEngine(ClientJMeterEngine.java:54)
   [concat] 	at org.apache.jmeter.engine.ClientJMeterEngine.<init>(ClientJMeterEngine.java:67)
   [concat] 	at org.apache.jmeter.engine.DistributedRunner.createEngine(DistributedRunner.java:237)
   [concat] 	at org.apache.jmeter.engine.DistributedRunner.getClientEngine(DistributedRunner.java:213)
   [concat] 	at org.apache.jmeter.engine.DistributedRunner.init(DistributedRunner.java:93)
   [concat] 	at org.apache.jmeter.JMeter.runNonGui(JMeter.java:841)
   [concat] 	at org.apache.jmeter.JMeter.startNonGui(JMeter.java:761)
   [concat] 	at org.apache.jmeter.JMeter.start(JMeter.java:421)
   [concat] 	at sun.reflect.NativeMethodAccessorImpl.invoke0(Native Method)
   [concat] 	at sun.reflect.NativeMethodAccessorImpl.invoke(NativeMethodAccessorImpl.java:57)
   [concat] 	at sun.reflect.DelegatingMethodAccessorImpl.invoke(DelegatingMethodAccessorImpl.java:43)
   [concat] 	at java.lang.reflect.Method.invoke(Method.java:606)
   [concat] 	at org.apache.jmeter.NewDriver.main(NewDriver.java:259)
   [concat] Caused by: java.net.ConnectException: Connection refused
   [concat] 	at java.net.PlainSocketImpl.socketConnect(Native Method)
   [concat] 	at java.net.AbstractPlainSocketImpl.doConnect(AbstractPlainSocketImpl.java:339)
   [concat] 	at java.net.AbstractPlainSocketImpl.connectToAddress(AbstractPlainSocketImpl.java:200)
   [concat] 	at java.net.AbstractPlainSocketImpl.connect(AbstractPlainSocketImpl.java:182)
   [concat] 	at java.net.SocksSocketImpl.connect(SocksSocketImpl.java:392)
   [concat] 	at java.net.Socket.connect(Socket.java:579)
   [concat] 	at java.net.Socket.connect(Socket.java:528)
   [concat] 	at java.net.Socket.<init>(Socket.java:425)
   [concat] 	at java.net.Socket.<init>(Socket.java:208)
   [concat] 	at sun.rmi.transport.proxy.RMIDirectSocketFactory.createSocket(RMIDirectSocketFactory.java:40)
   [concat] 	at sun.rmi.transport.proxy.RMIMasterSocketFactory.createSocket(RMIMasterSocketFactory.java:147)
   [concat] 	at sun.rmi.transport.tcp.TCPEndpoint.newSocket(TCPEndpoint.java:613)
   [concat] 	... 18 more
   [concat] 
   [concat] 2015/12/29 12:01:03 ERROR - jmeter.JMeter: Error in NonGUIDriver java.lang.RuntimeException:
Following remote engines could not be configured:[localhost:10100]
   [concat] 	at org.apache.jmeter.engine.DistributedRunner.init(DistributedRunner.java:112)
   [concat] 	at org.apache.jmeter.JMeter.runNonGui(JMeter.java:841)
   [concat] 	at org.apache.jmeter.JMeter.startNonGui(JMeter.java:761)
   [concat] 	at org.apache.jmeter.JMeter.start(JMeter.java:421)
   [concat] 	at sun.reflect.NativeMethodAccessorImpl.invoke0(Native Method)
   [concat] 	at sun.reflect.NativeMethodAccessorImpl.invoke(NativeMethodAccessorImpl.java:57)
   [concat] 	at sun.reflect.DelegatingMethodAccessorImpl.invoke(DelegatingMethodAccessorImpl.java:43)
   [concat] 	at java.lang.reflect.Method.invoke(Method.java:606)
   [concat] 	at org.apache.jmeter.NewDriver.main(NewDriver.java:259)
   [concat] 

BUILD FAILED
/x1/jenkins/jenkins-slave/workspace/JMeter-trunk/trunk/build.xml:2391: The following error
occurred while executing this line:
/x1/jenkins/jenkins-slave/workspace/JMeter-trunk/trunk/build.xml:2496: The following error
occurred while executing this line:
/x1/jenkins/jenkins-slave/workspace/JMeter-trunk/trunk/build.xml:2458: Cannot find output
file /x1/jenkins/jenkins-slave/workspace/JMeter-trunk/trunk/bin/BatchTestLocal.csv

Total time: 3 minutes 16 seconds
Build step 'Invoke Ant' marked build as failure
[locks-and-latches] Releasing all the locks
[locks-and-latches] All the locks released
Archiving artifacts
Compressed 101.69 MB of artifacts by 27.6% relative to #4857

Mime
View raw message