jmeter-dev mailing list archives

Site index · List index
Message view « Date » · « Thread »
Top « Date » · « Thread »
From Apache Jenkins Server <jenk...@builds.apache.org>
Subject Build failed in Jenkins: JMeter-trunk #5039
Date Thu, 03 Mar 2016 01:01:47 GMT
See <https://builds.apache.org/job/JMeter-trunk/5039/changes>

Changes:

[sebb] Tab police needed yet again

------------------------------------------
[...truncated 990 lines...]
  [javadoc] Loading source files for package org.apache.jmeter.protocol.java.test...
  [javadoc] Loading source files for package org.apache.jorphan.collections...
  [javadoc] Loading source files for package org.apache.jorphan.exec...
  [javadoc] Loading source files for package org.apache.jorphan.gui...
  [javadoc] Loading source files for package org.apache.jorphan.gui.layout...
  [javadoc] Loading source files for package org.apache.jorphan.io...
  [javadoc] Loading source files for package org.apache.jorphan.logging...
  [javadoc] Loading source files for package org.apache.jorphan.math...
  [javadoc] Loading source files for package org.apache.jorphan.reflect...
  [javadoc] Loading source files for package org.apache.jorphan.test...
  [javadoc] Loading source files for package org.apache.jorphan.util...
  [javadoc] Loading source files for package org.apache.jmeter.protocol.ldap.config.gui...
  [javadoc] Loading source files for package org.apache.jmeter.protocol.ldap.control.gui...
  [javadoc] Loading source files for package org.apache.jmeter.protocol.ldap.sampler...
  [javadoc] Loading source files for package org.apache.jmeter.protocol.tcp.config.gui...
  [javadoc] Loading source files for package org.apache.jmeter.protocol.tcp.control.gui...
  [javadoc] Loading source files for package org.apache.jmeter.protocol.tcp.sampler...
  [javadoc] Loading source files for package org.apache.jmeter.examples.sampler...
  [javadoc] Loading source files for package org.apache.jmeter.examples.sampler.gui...
  [javadoc] Loading source files for package org.apache.jmeter.examples.testbeans.example1...
  [javadoc] Loading source files for package org.apache.jmeter.examples.testbeans.example2...
  [javadoc] Loading source files for package org.apache.jmeter.examples.testbeans.example3...
  [javadoc] Loading source files for package org.apache.jmeter.protocol.mail.sampler...
  [javadoc] Loading source files for package org.apache.jmeter.protocol.mail.sampler.gui...
  [javadoc] Loading source files for package org.apache.jmeter.protocol.smtp.sampler...
  [javadoc] Loading source files for package org.apache.jmeter.protocol.smtp.sampler.gui...
  [javadoc] Loading source files for package org.apache.jmeter.protocol.smtp.sampler.protocol...
  [javadoc] Loading source files for package org.apache.jmeter.protocol.smtp.sampler.tools...
  [javadoc] Loading source files for package org.apache.jmeter.monitor.util...
  [javadoc] Loading source files for package org.apache.jmeter.monitor.model...
  [javadoc] Loading source files for package org.apache.jmeter.monitor.parser...
  [javadoc] Loading source files for package org.apache.jmeter.protocol.jms...
  [javadoc] Loading source files for package org.apache.jmeter.protocol.jms.client...
  [javadoc] Loading source files for package org.apache.jmeter.protocol.jms.control.gui...
  [javadoc] Loading source files for package org.apache.jmeter.protocol.jms.sampler...
  [javadoc] Loading source files for package org.apache.jmeter.protocol.system...
  [javadoc] Loading source files for package org.apache.jmeter.protocol.system.gui...
  [javadoc] Loading source files for package org.apache.jmeter.protocol.mongodb.config...
  [javadoc] Loading source files for package org.apache.jmeter.protocol.mongodb.mongo...
  [javadoc] Loading source files for package org.apache.jmeter.protocol.mongodb.sampler...
  [javadoc] Constructing Javadoc information...
  [javadoc] Standard Doclet version 1.7.0_80
  [javadoc] Building tree for all the packages and classes...
  [javadoc] /x1/jenkins/jenkins-slave/workspace/JMeter-trunk/trunk/src/protocol/http/org/apache/jmeter/protocol/http/sampler/HTTPHC4Impl.java:783:
warning - Tag @see:illegal character: "58" in "https://bz.apache.org/bugzilla/show_bug.cgi?id=58099"
  [javadoc] /x1/jenkins/jenkins-slave/workspace/JMeter-trunk/trunk/src/protocol/http/org/apache/jmeter/protocol/http/sampler/HTTPHC4Impl.java:783:
warning - Tag @see:illegal character: "47" in "https://bz.apache.org/bugzilla/show_bug.cgi?id=58099"
  [javadoc] /x1/jenkins/jenkins-slave/workspace/JMeter-trunk/trunk/src/protocol/http/org/apache/jmeter/protocol/http/sampler/HTTPHC4Impl.java:783:
warning - Tag @see:illegal character: "47" in "https://bz.apache.org/bugzilla/show_bug.cgi?id=58099"
  [javadoc] /x1/jenkins/jenkins-slave/workspace/JMeter-trunk/trunk/src/protocol/http/org/apache/jmeter/protocol/http/sampler/HTTPHC4Impl.java:783:
warning - Tag @see:illegal character: "47" in "https://bz.apache.org/bugzilla/show_bug.cgi?id=58099"
  [javadoc] /x1/jenkins/jenkins-slave/workspace/JMeter-trunk/trunk/src/protocol/http/org/apache/jmeter/protocol/http/sampler/HTTPHC4Impl.java:783:
warning - Tag @see:illegal character: "47" in "https://bz.apache.org/bugzilla/show_bug.cgi?id=58099"
  [javadoc] /x1/jenkins/jenkins-slave/workspace/JMeter-trunk/trunk/src/protocol/http/org/apache/jmeter/protocol/http/sampler/HTTPHC4Impl.java:783:
warning - Tag @see:illegal character: "63" in "https://bz.apache.org/bugzilla/show_bug.cgi?id=58099"
  [javadoc] /x1/jenkins/jenkins-slave/workspace/JMeter-trunk/trunk/src/protocol/http/org/apache/jmeter/protocol/http/sampler/HTTPHC4Impl.java:783:
warning - Tag @see:illegal character: "61" in "https://bz.apache.org/bugzilla/show_bug.cgi?id=58099"
  [javadoc] /x1/jenkins/jenkins-slave/workspace/JMeter-trunk/trunk/src/protocol/http/org/apache/jmeter/protocol/http/sampler/LazySchemeSocketFactory.java:78:
warning - @return tag has no arguments.
  [javadoc] /x1/jenkins/jenkins-slave/workspace/JMeter-trunk/trunk/src/protocol/http/org/apache/jmeter/protocol/http/sampler/LazySchemeSocketFactory.java:94:
warning - @return tag has no arguments.
  [javadoc] /x1/jenkins/jenkins-slave/workspace/JMeter-trunk/trunk/src/protocol/http/org/apache/jmeter/protocol/http/sampler/LazySchemeSocketFactory.java:107:
warning - @return tag has no arguments.
  [javadoc] /x1/jenkins/jenkins-slave/workspace/JMeter-trunk/trunk/src/protocol/http/org/apache/jmeter/protocol/http/sampler/MeasuringConnectionManager.java:73:
warning - Tag @see:illegal character: "58" in "https://bz.apache.org/bugzilla/show_bug.cgi?id=57935"
  [javadoc] /x1/jenkins/jenkins-slave/workspace/JMeter-trunk/trunk/src/protocol/http/org/apache/jmeter/protocol/http/sampler/MeasuringConnectionManager.java:73:
warning - Tag @see:illegal character: "47" in "https://bz.apache.org/bugzilla/show_bug.cgi?id=57935"
  [javadoc] /x1/jenkins/jenkins-slave/workspace/JMeter-trunk/trunk/src/protocol/http/org/apache/jmeter/protocol/http/sampler/MeasuringConnectionManager.java:73:
warning - Tag @see:illegal character: "47" in "https://bz.apache.org/bugzilla/show_bug.cgi?id=57935"
  [javadoc] /x1/jenkins/jenkins-slave/workspace/JMeter-trunk/trunk/src/protocol/http/org/apache/jmeter/protocol/http/sampler/MeasuringConnectionManager.java:73:
warning - Tag @see:illegal character: "47" in "https://bz.apache.org/bugzilla/show_bug.cgi?id=57935"
  [javadoc] /x1/jenkins/jenkins-slave/workspace/JMeter-trunk/trunk/src/protocol/http/org/apache/jmeter/protocol/http/sampler/MeasuringConnectionManager.java:73:
warning - Tag @see:illegal character: "47" in "https://bz.apache.org/bugzilla/show_bug.cgi?id=57935"
  [javadoc] /x1/jenkins/jenkins-slave/workspace/JMeter-trunk/trunk/src/protocol/http/org/apache/jmeter/protocol/http/sampler/MeasuringConnectionManager.java:73:
warning - Tag @see:illegal character: "63" in "https://bz.apache.org/bugzilla/show_bug.cgi?id=57935"
  [javadoc] /x1/jenkins/jenkins-slave/workspace/JMeter-trunk/trunk/src/protocol/http/org/apache/jmeter/protocol/http/sampler/MeasuringConnectionManager.java:73:
warning - Tag @see:illegal character: "61" in "https://bz.apache.org/bugzilla/show_bug.cgi?id=57935"
  [javadoc] /x1/jenkins/jenkins-slave/workspace/JMeter-trunk/trunk/src/protocol/http/org/apache/jmeter/protocol/http/sampler/MeasuringConnectionManager.java:73:
warning - Tag @see: reference not found: https://bz.apache.org/bugzilla/show_bug.cgi?id=57935
  [javadoc] Building index for all the packages and classes...
  [javadoc] Building index for all classes...
  [javadoc] Generating /x1/jenkins/jenkins-slave/workspace/JMeter-trunk/trunk/docs/api/help-doc.html...
  [javadoc] 18 warnings

docs-site:
     [xslt] Transforming into /x1/jenkins/jenkins-slave/workspace/JMeter-trunk/trunk/docs
     [xslt] Processing /x1/jenkins/jenkins-slave/workspace/JMeter-trunk/trunk/xdocs/building.xml
to /x1/jenkins/jenkins-slave/workspace/JMeter-trunk/trunk/docs/building.html
     [xslt] Loading stylesheet /x1/jenkins/jenkins-slave/workspace/JMeter-trunk/trunk/xdocs/stylesheets/website-style.xsl
     [xslt] Processing /x1/jenkins/jenkins-slave/workspace/JMeter-trunk/trunk/xdocs/changes.xml
to /x1/jenkins/jenkins-slave/workspace/JMeter-trunk/trunk/docs/changes.html
     [xslt] Processing /x1/jenkins/jenkins-slave/workspace/JMeter-trunk/trunk/xdocs/changes_history.xml
to /x1/jenkins/jenkins-slave/workspace/JMeter-trunk/trunk/docs/changes_history.html
     [xslt] Processing /x1/jenkins/jenkins-slave/workspace/JMeter-trunk/trunk/xdocs/devguide-dashboard.xml
to /x1/jenkins/jenkins-slave/workspace/JMeter-trunk/trunk/docs/devguide-dashboard.html
     [xslt] Processing /x1/jenkins/jenkins-slave/workspace/JMeter-trunk/trunk/xdocs/download_jmeter.xml
to /x1/jenkins/jenkins-slave/workspace/JMeter-trunk/trunk/docs/download_jmeter.html
     [xslt] Processing /x1/jenkins/jenkins-slave/workspace/JMeter-trunk/trunk/xdocs/index.xml
to /x1/jenkins/jenkins-slave/workspace/JMeter-trunk/trunk/docs/index.html
     [xslt] Processing /x1/jenkins/jenkins-slave/workspace/JMeter-trunk/trunk/xdocs/issues.xml
to /x1/jenkins/jenkins-slave/workspace/JMeter-trunk/trunk/docs/issues.html
     [xslt] Processing /x1/jenkins/jenkins-slave/workspace/JMeter-trunk/trunk/xdocs/jmeter_irc.xml
to /x1/jenkins/jenkins-slave/workspace/JMeter-trunk/trunk/docs/jmeter_irc.html
     [xslt] Processing /x1/jenkins/jenkins-slave/workspace/JMeter-trunk/trunk/xdocs/mail.xml
to /x1/jenkins/jenkins-slave/workspace/JMeter-trunk/trunk/docs/mail.html
     [xslt] Processing /x1/jenkins/jenkins-slave/workspace/JMeter-trunk/trunk/xdocs/mail2.xml
to /x1/jenkins/jenkins-slave/workspace/JMeter-trunk/trunk/docs/mail2.html
     [xslt] Processing /x1/jenkins/jenkins-slave/workspace/JMeter-trunk/trunk/xdocs/nightly.xml
to /x1/jenkins/jenkins-slave/workspace/JMeter-trunk/trunk/docs/nightly.html
     [xslt] Processing /x1/jenkins/jenkins-slave/workspace/JMeter-trunk/trunk/xdocs/svnindex.xml
to /x1/jenkins/jenkins-slave/workspace/JMeter-trunk/trunk/docs/svnindex.html
     [xslt] Transforming into /x1/jenkins/jenkins-slave/workspace/JMeter-trunk/trunk/docs/usermanual
     [xslt] Processing /x1/jenkins/jenkins-slave/workspace/JMeter-trunk/trunk/xdocs/usermanual/best-practices.xml
to /x1/jenkins/jenkins-slave/workspace/JMeter-trunk/trunk/docs/usermanual/best-practices.html
     [xslt] Loading stylesheet /x1/jenkins/jenkins-slave/workspace/JMeter-trunk/trunk/xdocs/stylesheets/website-style.xsl
     [xslt] Processing /x1/jenkins/jenkins-slave/workspace/JMeter-trunk/trunk/xdocs/usermanual/boss.xml
to /x1/jenkins/jenkins-slave/workspace/JMeter-trunk/trunk/docs/usermanual/boss.html
     [xslt] Processing /x1/jenkins/jenkins-slave/workspace/JMeter-trunk/trunk/xdocs/usermanual/build-adv-web-test-plan.xml
to /x1/jenkins/jenkins-slave/workspace/JMeter-trunk/trunk/docs/usermanual/build-adv-web-test-plan.html
     [xslt] Processing /x1/jenkins/jenkins-slave/workspace/JMeter-trunk/trunk/xdocs/usermanual/build-db-test-plan.xml
to /x1/jenkins/jenkins-slave/workspace/JMeter-trunk/trunk/docs/usermanual/build-db-test-plan.html
     [xslt] Processing /x1/jenkins/jenkins-slave/workspace/JMeter-trunk/trunk/xdocs/usermanual/build-ftp-test-plan.xml
to /x1/jenkins/jenkins-slave/workspace/JMeter-trunk/trunk/docs/usermanual/build-ftp-test-plan.html
     [xslt] Processing /x1/jenkins/jenkins-slave/workspace/JMeter-trunk/trunk/xdocs/usermanual/build-jms-point-to-point-test-plan.xml
to /x1/jenkins/jenkins-slave/workspace/JMeter-trunk/trunk/docs/usermanual/build-jms-point-to-point-test-plan.html
     [xslt] Processing /x1/jenkins/jenkins-slave/workspace/JMeter-trunk/trunk/xdocs/usermanual/build-jms-topic-test-plan.xml
to /x1/jenkins/jenkins-slave/workspace/JMeter-trunk/trunk/docs/usermanual/build-jms-topic-test-plan.html
     [xslt] Processing /x1/jenkins/jenkins-slave/workspace/JMeter-trunk/trunk/xdocs/usermanual/build-ldap-test-plan.xml
to /x1/jenkins/jenkins-slave/workspace/JMeter-trunk/trunk/docs/usermanual/build-ldap-test-plan.html
     [xslt] Processing /x1/jenkins/jenkins-slave/workspace/JMeter-trunk/trunk/xdocs/usermanual/build-ldapext-test-plan.xml
to /x1/jenkins/jenkins-slave/workspace/JMeter-trunk/trunk/docs/usermanual/build-ldapext-test-plan.html
     [xslt] Processing /x1/jenkins/jenkins-slave/workspace/JMeter-trunk/trunk/xdocs/usermanual/build-monitor-test-plan.xml
to /x1/jenkins/jenkins-slave/workspace/JMeter-trunk/trunk/docs/usermanual/build-monitor-test-plan.html
     [xslt] Processing /x1/jenkins/jenkins-slave/workspace/JMeter-trunk/trunk/xdocs/usermanual/build-test-plan.xml
to /x1/jenkins/jenkins-slave/workspace/JMeter-trunk/trunk/docs/usermanual/build-test-plan.html
     [xslt] Processing /x1/jenkins/jenkins-slave/workspace/JMeter-trunk/trunk/xdocs/usermanual/build-web-test-plan.xml
to /x1/jenkins/jenkins-slave/workspace/JMeter-trunk/trunk/docs/usermanual/build-web-test-plan.html
     [xslt] Processing /x1/jenkins/jenkins-slave/workspace/JMeter-trunk/trunk/xdocs/usermanual/build-ws-test-plan.xml
to /x1/jenkins/jenkins-slave/workspace/JMeter-trunk/trunk/docs/usermanual/build-ws-test-plan.html
     [xslt] Processing /x1/jenkins/jenkins-slave/workspace/JMeter-trunk/trunk/xdocs/usermanual/component_reference.xml
to /x1/jenkins/jenkins-slave/workspace/JMeter-trunk/trunk/docs/usermanual/component_reference.html
     [xslt] Processing /x1/jenkins/jenkins-slave/workspace/JMeter-trunk/trunk/xdocs/usermanual/functions.xml
to /x1/jenkins/jenkins-slave/workspace/JMeter-trunk/trunk/docs/usermanual/functions.html
     [xslt] Processing /x1/jenkins/jenkins-slave/workspace/JMeter-trunk/trunk/xdocs/usermanual/generating-dashboard.xml
to /x1/jenkins/jenkins-slave/workspace/JMeter-trunk/trunk/docs/usermanual/generating-dashboard.html
     [xslt] Processing /x1/jenkins/jenkins-slave/workspace/JMeter-trunk/trunk/xdocs/usermanual/get-started.xml
to /x1/jenkins/jenkins-slave/workspace/JMeter-trunk/trunk/docs/usermanual/get-started.html
     [xslt] Processing /x1/jenkins/jenkins-slave/workspace/JMeter-trunk/trunk/xdocs/usermanual/glossary.xml
to /x1/jenkins/jenkins-slave/workspace/JMeter-trunk/trunk/docs/usermanual/glossary.html
     [xslt] Processing /x1/jenkins/jenkins-slave/workspace/JMeter-trunk/trunk/xdocs/usermanual/hints_and_tips.xml
to /x1/jenkins/jenkins-slave/workspace/JMeter-trunk/trunk/docs/usermanual/hints_and_tips.html
     [xslt] Processing /x1/jenkins/jenkins-slave/workspace/JMeter-trunk/trunk/xdocs/usermanual/index.xml
to /x1/jenkins/jenkins-slave/workspace/JMeter-trunk/trunk/docs/usermanual/index.html
     [xslt] Processing /x1/jenkins/jenkins-slave/workspace/JMeter-trunk/trunk/xdocs/usermanual/intro.xml
to /x1/jenkins/jenkins-slave/workspace/JMeter-trunk/trunk/docs/usermanual/intro.html
     [xslt] Processing /x1/jenkins/jenkins-slave/workspace/JMeter-trunk/trunk/xdocs/usermanual/ldapanswer_xml.xml
to /x1/jenkins/jenkins-slave/workspace/JMeter-trunk/trunk/docs/usermanual/ldapanswer_xml.html
     [xslt] Processing /x1/jenkins/jenkins-slave/workspace/JMeter-trunk/trunk/xdocs/usermanual/ldapops_tutor.xml
to /x1/jenkins/jenkins-slave/workspace/JMeter-trunk/trunk/docs/usermanual/ldapops_tutor.html
     [xslt] Processing /x1/jenkins/jenkins-slave/workspace/JMeter-trunk/trunk/xdocs/usermanual/listeners.xml
to /x1/jenkins/jenkins-slave/workspace/JMeter-trunk/trunk/docs/usermanual/listeners.html
     [xslt] Processing /x1/jenkins/jenkins-slave/workspace/JMeter-trunk/trunk/xdocs/usermanual/realtime-results.xml
to /x1/jenkins/jenkins-slave/workspace/JMeter-trunk/trunk/docs/usermanual/realtime-results.html
     [xslt] Processing /x1/jenkins/jenkins-slave/workspace/JMeter-trunk/trunk/xdocs/usermanual/regular_expressions.xml
to /x1/jenkins/jenkins-slave/workspace/JMeter-trunk/trunk/docs/usermanual/regular_expressions.html
     [xslt] Processing /x1/jenkins/jenkins-slave/workspace/JMeter-trunk/trunk/xdocs/usermanual/remote-test.xml
to /x1/jenkins/jenkins-slave/workspace/JMeter-trunk/trunk/docs/usermanual/remote-test.html
     [xslt] Processing /x1/jenkins/jenkins-slave/workspace/JMeter-trunk/trunk/xdocs/usermanual/test_plan.xml
to /x1/jenkins/jenkins-slave/workspace/JMeter-trunk/trunk/docs/usermanual/test_plan.html
     [xslt] Transforming into /x1/jenkins/jenkins-slave/workspace/JMeter-trunk/trunk/docs/localising
     [xslt] Processing /x1/jenkins/jenkins-slave/workspace/JMeter-trunk/trunk/xdocs/localising/index.xml
to /x1/jenkins/jenkins-slave/workspace/JMeter-trunk/trunk/docs/localising/index.html
     [xslt] Loading stylesheet /x1/jenkins/jenkins-slave/workspace/JMeter-trunk/trunk/xdocs/stylesheets/website-style.xsl
     [echo] Fixing EOL
     [echo] Removing unnecessary </br> tags
     [copy] Copying 16 files to /x1/jenkins/jenkins-slave/workspace/JMeter-trunk/trunk/docs/demos
     [copy] Copying 5 files to /x1/jenkins/jenkins-slave/workspace/JMeter-trunk/trunk/docs/usermanual
     [copy] Copying 1 file to /x1/jenkins/jenkins-slave/workspace/JMeter-trunk/trunk/docs/extending
     [copy] Copying 1 file to /x1/jenkins/jenkins-slave/workspace/JMeter-trunk/trunk/docs

compile-tests:
    [javac] Compiling 125 source files to /x1/jenkins/jenkins-slave/workspace/JMeter-trunk/trunk/build/test
    [javac] Note: Some input files use or override a deprecated API.
    [javac] Note: Recompile with -Xlint:deprecation for details.

_test:
     [echo] 
     [echo]    gump.run = false
     [echo]    java.awt.headless = true
     [echo]    test.headless = true
     [echo]    user.dir = /x1/jenkins/jenkins-slave/workspace/JMeter-trunk/trunk
     [echo]    basedir = /x1/jenkins/jenkins-slave/workspace/JMeter-trunk/trunk
     [echo]    test dir = build/test
     [echo]    test dir gump = build/test
     [echo]    testsaveservice.saveout = ${testsaveservice.saveout}
     [echo]    test.encoding = UTF-8
     [echo]    
     [java] Setting JMeterHome: /x1/jenkins/jenkins-slave/workspace/JMeter-trunk/trunk
     [java] Setting up logging props using file: /x1/jenkins/jenkins-slave/workspace/JMeter-trunk/trunk/bin/testfiles/jmetertest.properties
     [java] Writing log file to:/x1/jenkins/jenkins-slave/workspace/JMeter-trunk/trunk/bin/jmeter-test.log
     [java] Using initializeProperties() from org.apache.jmeter.util.JMeterUtils
     [java] Setting up initial properties using: /x1/jenkins/jenkins-slave/workspace/JMeter-trunk/trunk/bin/testfiles/jmetertest.properties
     [java] Initializing Properties: /x1/jenkins/jenkins-slave/workspace/JMeter-trunk/trunk/bin/testfiles/jmetertest.properties
     [java] Writing log file to:/x1/jenkins/jenkins-slave/workspace/JMeter-trunk/trunk/bin/jmeter-test.log
     [java] JMeterVersion=r1733393
     [java] java.version=1.7.0_80
     [java] java.home=/x1/jenkins/jenkins-slave/tools/hudson.model.JDK/latest1.7/jre
     [java] file.encoding=UTF-8
     [java] default encoding=UTF-8
     [java] user.dir=/x1/jenkins/jenkins-slave/workspace/JMeter-trunk/trunk/bin
     [java] Locale=en_US
     [java] os.name=Linux
     [java] os.version=3.2.0-99-generic
     [java] +++++++++++
     [java] java.awt.headless=true
     [java] java.awt.graphicsenv=sun.awt.X11GraphicsEnvironment
     [java] ------------
     [java] Searching junit tests in : build/test
     [java] Skipping test:org.apache.jmeter.junit.JMeterTest, cannot run in Headless mode
     [java] .....................................................................................................................................................................................................................................................................................................................................................................................................................................................................................................................................................................................................................................................................................................................................................................................................................................................................................................................................................................................................................................................................................................................................................................................................................................................................................................................................................................................................................................................................................................................................................................................................................................................................................................I.............................................................................................................................................................................................................................................
     [java] Time: 84.11
     [java] 
     [java] OK (1874 tests)
     [java] 

batchtest:
     [echo] Starting BatchTestLocal using -X
   [jmeter] Writing log file to:/x1/jenkins/jenkins-slave/workspace/JMeter-trunk/trunk/bin/BatchTestLocal.log
   [jmeter] Created the tree successfully using testfiles/BatchTestLocal.jmx
   [jmeter] Starting the test @ Thu Mar 03 01:01:10 UTC 2016 (1456966870055)
   [jmeter] Waiting for possible Shutdown/StopTestNow/Heapdump message on port 4445
   [jmeter] Tidying up ...    @ Thu Mar 03 01:01:47 UTC 2016 (1456966907744)
   [jmeter] ... end of run
     [echo] BatchTestLocal output files compared OK

batchtestserver:
   [server] Writing log file to:/x1/jenkins/jenkins-slave/workspace/JMeter-trunk/trunk/bin/BatchTestServer.log

batchtest:
     [echo] Starting BatchTestLocal using -Rlocalhost:10148
   [client] Writing log file to:/x1/jenkins/jenkins-slave/workspace/JMeter-trunk/trunk/bin/BatchTestLocal.log
   [client] Created the tree successfully using testfiles/BatchTestLocal.jmx
   [client] Configuring remote engine: localhost:10148
   [client] Connection refused to host: localhost; nested exception is: 
   [client] 	java.net.ConnectException: Connection refused
   [client] Failed to configure localhost:10148
   [client] Stopping remote engines
   [client] Remote engines have been stopped
   [client] Error in NonGUIDriver java.lang.RuntimeException: Following remote engines could
not be configured:[localhost:10148]
   [server] Created remote object: UnicastServerRef [liveRef: [endpoint:[140.211.11.27:43967](local),objID:[-2597714e:15339fec04f:-7fff,
966136965950369922]]]
   [concat] 2016/03/03 01:01:51 ERROR - jmeter.engine.DistributedRunner: Failed to create
engine at localhost:10148 java.rmi.ConnectException: Connection refused to host: localhost;
nested exception is: 
   [concat] 	java.net.ConnectException: Connection refused
   [concat] 	at sun.rmi.transport.tcp.TCPEndpoint.newSocket(TCPEndpoint.java:619)
   [concat] 	at sun.rmi.transport.tcp.TCPChannel.createConnection(TCPChannel.java:216)
   [concat] 	at sun.rmi.transport.tcp.TCPChannel.newConnection(TCPChannel.java:202)
   [concat] 	at sun.rmi.server.UnicastRef.newCall(UnicastRef.java:341)
   [concat] 	at sun.rmi.registry.RegistryImpl_Stub.lookup(Unknown Source)
   [concat] 	at java.rmi.Naming.lookup(Naming.java:101)
   [concat] 	at org.apache.jmeter.engine.ClientJMeterEngine.getEngine(ClientJMeterEngine.java:54)
   [concat] 	at org.apache.jmeter.engine.ClientJMeterEngine.<init>(ClientJMeterEngine.java:67)
   [concat] 	at org.apache.jmeter.engine.DistributedRunner.createEngine(DistributedRunner.java:237)
   [concat] 	at org.apache.jmeter.engine.DistributedRunner.getClientEngine(DistributedRunner.java:213)
   [concat] 	at org.apache.jmeter.engine.DistributedRunner.init(DistributedRunner.java:93)
   [concat] 	at org.apache.jmeter.JMeter.runNonGui(JMeter.java:937)
   [concat] 	at org.apache.jmeter.JMeter.startNonGui(JMeter.java:857)
   [concat] 	at org.apache.jmeter.JMeter.start(JMeter.java:517)
   [concat] 	at sun.reflect.NativeMethodAccessorImpl.invoke0(Native Method)
   [concat] 	at sun.reflect.NativeMethodAccessorImpl.invoke(NativeMethodAccessorImpl.java:57)
   [concat] 	at sun.reflect.DelegatingMethodAccessorImpl.invoke(DelegatingMethodAccessorImpl.java:43)
   [concat] 	at java.lang.reflect.Method.invoke(Method.java:606)
   [concat] 	at org.apache.jmeter.NewDriver.main(NewDriver.java:259)
   [concat] Caused by: java.net.ConnectException: Connection refused
   [concat] 	at java.net.PlainSocketImpl.socketConnect(Native Method)
   [concat] 	at java.net.AbstractPlainSocketImpl.doConnect(AbstractPlainSocketImpl.java:339)
   [concat] 	at java.net.AbstractPlainSocketImpl.connectToAddress(AbstractPlainSocketImpl.java:200)
   [concat] 	at java.net.AbstractPlainSocketImpl.connect(AbstractPlainSocketImpl.java:182)
   [concat] 	at java.net.SocksSocketImpl.connect(SocksSocketImpl.java:392)
   [concat] 	at java.net.Socket.connect(Socket.java:579)
   [concat] 	at java.net.Socket.connect(Socket.java:528)
   [concat] 	at java.net.Socket.<init>(Socket.java:425)
   [concat] 	at java.net.Socket.<init>(Socket.java:208)
   [concat] 	at sun.rmi.transport.proxy.RMIDirectSocketFactory.createSocket(RMIDirectSocketFactory.java:40)
   [concat] 	at sun.rmi.transport.proxy.RMIMasterSocketFactory.createSocket(RMIMasterSocketFactory.java:147)
   [concat] 	at sun.rmi.transport.tcp.TCPEndpoint.newSocket(TCPEndpoint.java:613)
   [concat] 	... 18 more
   [concat] 
   [concat] 2016/03/03 01:01:51 ERROR - jmeter.JMeter: Error in NonGUIDriver java.lang.RuntimeException:
Following remote engines could not be configured:[localhost:10148]
   [concat] 	at org.apache.jmeter.engine.DistributedRunner.init(DistributedRunner.java:112)
   [concat] 	at org.apache.jmeter.JMeter.runNonGui(JMeter.java:937)
   [concat] 	at org.apache.jmeter.JMeter.startNonGui(JMeter.java:857)
   [concat] 	at org.apache.jmeter.JMeter.start(JMeter.java:517)
   [concat] 	at sun.reflect.NativeMethodAccessorImpl.invoke0(Native Method)
   [concat] 	at sun.reflect.NativeMethodAccessorImpl.invoke(NativeMethodAccessorImpl.java:57)
   [concat] 	at sun.reflect.DelegatingMethodAccessorImpl.invoke(DelegatingMethodAccessorImpl.java:43)
   [concat] 	at java.lang.reflect.Method.invoke(Method.java:606)
   [concat] 	at org.apache.jmeter.NewDriver.main(NewDriver.java:259)
   [concat] 

BUILD FAILED
/x1/jenkins/jenkins-slave/workspace/JMeter-trunk/trunk/build.xml:2393: The following error
occurred while executing this line:
/x1/jenkins/jenkins-slave/workspace/JMeter-trunk/trunk/build.xml:2500: The following error
occurred while executing this line:
/x1/jenkins/jenkins-slave/workspace/JMeter-trunk/trunk/build.xml:2460: Cannot find output
file /x1/jenkins/jenkins-slave/workspace/JMeter-trunk/trunk/bin/BatchTestLocal.csv

Total time: 4 minutes 3 seconds
Build step 'Invoke Ant' marked build as failure
[locks-and-latches] Releasing all the locks
[locks-and-latches] All the locks released
Archiving artifacts

Mime
View raw message