jmeter-dev mailing list archives

Site index · List index
Message view « Date » · « Thread »
Top « Date » · « Thread »
From Apache Jenkins Server <jenk...@builds.apache.org>
Subject Build failed in Jenkins: JMeter-trunk #5075
Date Sat, 12 Mar 2016 14:48:40 GMT
See <https://builds.apache.org/job/JMeter-trunk/5075/changes>

Changes:

[pmouawad] Bug 59076 - Test should fail if a module controller cannot find its replacement
subtree
Take into account sebb note
Bugzilla Id: 59076

[pmouawad] Improve display of JMeter on high resolution devices (HiDPI) (part 1 of enhancement)
Rename issue after dev mailing list discussion
Bugzilla Id: 58426

[pmouawad] Bug 59156 - XMLAssertion : drop jdom dependency by using XMLReader
Move code to standard Java XML API
Fix Tests to remove dependencies on jdom
Move jdom download to lib/doc as it is needed for printable documentation generation (Anakia)
Remove jdom from Maven dependencies and also remove velocity version property by the way as
it is not needed (commented)
Move jdom reference in build.properties in the doc block
Bugzilla Id: 59156

------------------------------------------
[...truncated 1099 lines...]
  [javadoc] Loading source files for package org.apache.jmeter.functions.gui...
  [javadoc] Loading source files for package org.apache.jmeter.functions.util...
  [javadoc] Loading source files for package org.apache.jmeter.gui...
  [javadoc] Loading source files for package org.apache.jmeter.gui.action...
  [javadoc] Loading source files for package org.apache.jmeter.gui.action.template...
  [javadoc] Loading source files for package org.apache.jmeter.gui.plugin...
  [javadoc] Loading source files for package org.apache.jmeter.gui.tree...
  [javadoc] Loading source files for package org.apache.jmeter.gui.util...
  [javadoc] Loading source files for package org.apache.jmeter.plugin...
  [javadoc] Loading source files for package org.apache.jmeter.processor...
  [javadoc] Loading source files for package org.apache.jmeter.processor.gui...
  [javadoc] Loading source files for package org.apache.jmeter.report.config...
  [javadoc] Loading source files for package org.apache.jmeter.report.core...
  [javadoc] Loading source files for package org.apache.jmeter.report.dashboard...
  [javadoc] Loading source files for package org.apache.jmeter.report.processor...
  [javadoc] Loading source files for package org.apache.jmeter.report.processor.graph...
  [javadoc] Loading source files for package org.apache.jmeter.report.processor.graph.impl...
  [javadoc] Loading source files for package org.apache.jmeter.reporters...
  [javadoc] Loading source files for package org.apache.jmeter.reporters.gui...
  [javadoc] Loading source files for package org.apache.jmeter.samplers...
  [javadoc] Loading source files for package org.apache.jmeter.samplers.gui...
  [javadoc] Loading source files for package org.apache.jmeter.save...
  [javadoc] Loading source files for package org.apache.jmeter.save.converters...
  [javadoc] Loading source files for package org.apache.jmeter.services...
  [javadoc] Loading source files for package org.apache.jmeter.swing...
  [javadoc] Loading source files for package org.apache.jmeter.testbeans...
  [javadoc] Loading source files for package org.apache.jmeter.testbeans.gui...
  [javadoc] Loading source files for package org.apache.jmeter.testelement...
  [javadoc] Loading source files for package org.apache.jmeter.testelement.property...
  [javadoc] Loading source files for package org.apache.jmeter.threads...
  [javadoc] Loading source files for package org.apache.jmeter.threads.gui...
  [javadoc] Loading source files for package org.apache.jmeter.timers...
  [javadoc] Loading source files for package org.apache.jmeter.timers.gui...
  [javadoc] Loading source files for package org.apache.jmeter.util...
  [javadoc] Loading source files for package org.apache.jmeter.util.keystore...
  [javadoc] Loading source files for package org.apache.jmeter.visualizers...
  [javadoc] Loading source files for package org.apache.jmeter.visualizers.gui...
  [javadoc] Loading source files for package org.apache.jmeter.extractor...
  [javadoc] Loading source files for package org.apache.jmeter.extractor.gui...
  [javadoc] Loading source files for package org.apache.jmeter.extractor.json.jsonpath...
  [javadoc] Loading source files for package org.apache.jmeter.extractor.json.jsonpath.gui...
  [javadoc] Loading source files for package org.apache.jmeter.extractor.json.render...
  [javadoc] Loading source files for package org.apache.jmeter.modifiers...
  [javadoc] Loading source files for package org.apache.jmeter.modifiers.gui...
  [javadoc] Loading source files for package org.apache.jmeter.sampler...
  [javadoc] Loading source files for package org.apache.jmeter.sampler.gui...
  [javadoc] Loading source files for package org.apache.jmeter.visualizers.backend...
  [javadoc] Loading source files for package org.apache.jmeter.visualizers.backend.graphite...
  [javadoc] Loading source files for package org.apache.jmeter.visualizers.utils...
  [javadoc] Loading source files for package org.apache.jmeter.protocol.http.config...
  [javadoc] Loading source files for package org.apache.jmeter.protocol.http.config.gui...
  [javadoc] Loading source files for package org.apache.jmeter.protocol.http.control...
  [javadoc] Loading source files for package org.apache.jmeter.protocol.http.control.gui...
  [javadoc] Loading source files for package org.apache.jmeter.protocol.http.gui...
  [javadoc] Loading source files for package org.apache.jmeter.protocol.http.modifier...
  [javadoc] Loading source files for package org.apache.jmeter.protocol.http.modifier.gui...
  [javadoc] Loading source files for package org.apache.jmeter.protocol.http.parser...
  [javadoc] Loading source files for package org.apache.jmeter.protocol.http.proxy...
  [javadoc] Loading source files for package org.apache.jmeter.protocol.http.proxy.gui...
  [javadoc] Loading source files for package org.apache.jmeter.protocol.http.sampler...
  [javadoc] Loading source files for package org.apache.jmeter.protocol.http.util...
  [javadoc] Loading source files for package org.apache.jmeter.protocol.http.util.accesslog...
  [javadoc] Loading source files for package org.apache.jmeter.protocol.http.visualizers...
  [javadoc] Loading source files for package org.apache.jmeter.protocol.ftp.config.gui...
  [javadoc] Loading source files for package org.apache.jmeter.protocol.ftp.control.gui...
  [javadoc] Loading source files for package org.apache.jmeter.protocol.ftp.sampler...
  [javadoc] Loading source files for package org.apache.jmeter.protocol.jdbc...
  [javadoc] Loading source files for package org.apache.jmeter.protocol.jdbc.config...
  [javadoc] Loading source files for package org.apache.jmeter.protocol.jdbc.processor...
  [javadoc] Loading source files for package org.apache.jmeter.protocol.jdbc.sampler...
  [javadoc] Loading source files for package org.apache.jmeter.protocol.java.config...
  [javadoc] Loading source files for package org.apache.jmeter.protocol.java.config.gui...
  [javadoc] Loading source files for package org.apache.jmeter.protocol.java.control.gui...
  [javadoc] Loading source files for package org.apache.jmeter.protocol.java.sampler...
  [javadoc] Loading source files for package org.apache.jmeter.protocol.java.test...
  [javadoc] Loading source files for package org.apache.jorphan.collections...
  [javadoc] Loading source files for package org.apache.jorphan.exec...
  [javadoc] Loading source files for package org.apache.jorphan.gui...
  [javadoc] Loading source files for package org.apache.jorphan.gui.layout...
  [javadoc] Loading source files for package org.apache.jorphan.io...
  [javadoc] Loading source files for package org.apache.jorphan.logging...
  [javadoc] Loading source files for package org.apache.jorphan.math...
  [javadoc] Loading source files for package org.apache.jorphan.reflect...
  [javadoc] Loading source files for package org.apache.jorphan.test...
  [javadoc] Loading source files for package org.apache.jorphan.util...
  [javadoc] Loading source files for package org.apache.jmeter.protocol.ldap.config.gui...
  [javadoc] Loading source files for package org.apache.jmeter.protocol.ldap.control.gui...
  [javadoc] Loading source files for package org.apache.jmeter.protocol.ldap.sampler...
  [javadoc] Loading source files for package org.apache.jmeter.protocol.tcp.config.gui...
  [javadoc] Loading source files for package org.apache.jmeter.protocol.tcp.control.gui...
  [javadoc] Loading source files for package org.apache.jmeter.protocol.tcp.sampler...
  [javadoc] Loading source files for package org.apache.jmeter.examples.sampler...
  [javadoc] Loading source files for package org.apache.jmeter.examples.sampler.gui...
  [javadoc] Loading source files for package org.apache.jmeter.examples.testbeans.example1...
  [javadoc] Loading source files for package org.apache.jmeter.examples.testbeans.example2...
  [javadoc] Loading source files for package org.apache.jmeter.examples.testbeans.example3...
  [javadoc] Loading source files for package org.apache.jmeter.protocol.mail.sampler...
  [javadoc] Loading source files for package org.apache.jmeter.protocol.mail.sampler.gui...
  [javadoc] Loading source files for package org.apache.jmeter.protocol.smtp.sampler...
  [javadoc] Loading source files for package org.apache.jmeter.protocol.smtp.sampler.gui...
  [javadoc] Loading source files for package org.apache.jmeter.protocol.smtp.sampler.protocol...
  [javadoc] Loading source files for package org.apache.jmeter.protocol.smtp.sampler.tools...
  [javadoc] Loading source files for package org.apache.jmeter.monitor.util...
  [javadoc] Loading source files for package org.apache.jmeter.monitor.model...
  [javadoc] Loading source files for package org.apache.jmeter.monitor.parser...
  [javadoc] Loading source files for package org.apache.jmeter.protocol.jms...
  [javadoc] Loading source files for package org.apache.jmeter.protocol.jms.client...
  [javadoc] Loading source files for package org.apache.jmeter.protocol.jms.control.gui...
  [javadoc] Loading source files for package org.apache.jmeter.protocol.jms.sampler...
  [javadoc] Loading source files for package org.apache.jmeter.protocol.system...
  [javadoc] Loading source files for package org.apache.jmeter.protocol.system.gui...
  [javadoc] Loading source files for package org.apache.jmeter.protocol.mongodb.config...
  [javadoc] Loading source files for package org.apache.jmeter.protocol.mongodb.mongo...
  [javadoc] Loading source files for package org.apache.jmeter.protocol.mongodb.sampler...
  [javadoc] Constructing Javadoc information...
  [javadoc] Standard Doclet version 1.7.0_80
  [javadoc] Building tree for all the packages and classes...
  [javadoc] Building index for all the packages and classes...
  [javadoc] Building index for all classes...

compile-tests:
    [javac] Compiling 127 source files to <https://builds.apache.org/job/JMeter-trunk/ws/trunk/build/test>
    [javac] Note: Some input files use or override a deprecated API.
    [javac] Note: Recompile with -Xlint:deprecation for details.

_test:
     [echo] 
     [echo]    gump.run = false
     [echo]    java.awt.headless = true
     [echo]    test.headless = true
     [echo]    user.dir = <https://builds.apache.org/job/JMeter-trunk/ws/trunk>
     [echo]    basedir = <https://builds.apache.org/job/JMeter-trunk/ws/trunk>
     [echo]    test dir = build/test
     [echo]    test dir gump = build/test
     [echo]    testsaveservice.saveout = ${testsaveservice.saveout}
     [echo]    test.encoding = UTF-8
     [echo]    
     [java] Setting JMeterHome: <https://builds.apache.org/job/JMeter-trunk/ws/trunk>
     [java] Setting up logging props using file: <https://builds.apache.org/job/JMeter-trunk/ws/trunk/bin/testfiles/jmetertest.properties>
     [java] Writing log file to:<https://builds.apache.org/job/JMeter-trunk/ws/trunk/bin/jmeter-test.log>
     [java] Using initializeProperties() from org.apache.jmeter.util.JMeterUtils
     [java] Setting up initial properties using: <https://builds.apache.org/job/JMeter-trunk/ws/trunk/bin/testfiles/jmetertest.properties>
     [java] Initializing Properties: <https://builds.apache.org/job/JMeter-trunk/ws/trunk/bin/testfiles/jmetertest.properties>
     [java] Writing log file to:<https://builds.apache.org/job/JMeter-trunk/ws/trunk/bin/jmeter-test.log>
     [java] JMeterVersion=r1734711
     [java] java.version=1.7.0_80
     [java] java.home=/home/jenkins/jenkins-slave/tools/hudson.model.JDK/latest1.7/jre
     [java] file.encoding=UTF-8
     [java] default encoding=UTF-8
     [java] user.dir=<https://builds.apache.org/job/JMeter-trunk/ws/trunk/bin>
     [java] Locale=en_US
     [java] os.name=Linux
     [java] os.version=3.13.0-36-lowlatency
     [java] +++++++++++
     [java] java.awt.headless=true
     [java] java.awt.graphicsenv=sun.awt.X11GraphicsEnvironment
     [java] ------------
     [java] Searching junit tests in : build/test
     [java] o.a.j.junit.JMeterTest INFO: JMeterGUIComponent: skipping some tests org.apache.jmeter.testbeans.gui.TestBeanGUI
     [java] o.a.j.junit.JMeterTest Error creating org.apache.jmeter.config.gui.RowDetailDialog
java.awt.HeadlessException
     [java] o.a.j.junit.JMeterTest Error creating org.apache.jmeter.functions.gui.FunctionHelper
java.awt.HeadlessException
     [java] o.a.j.junit.JMeterTest Error creating org.apache.jmeter.gui.MainFrame java.awt.HeadlessException
     [java] o.a.j.junit.JMeterTest Error creating org.apache.jmeter.gui.SavePropertyDialog
java.awt.HeadlessException
     [java] o.a.j.junit.JMeterTest Error creating org.apache.jmeter.gui.action.SearchTreeDialog
java.awt.HeadlessException
     [java] o.a.j.junit.JMeterTest Error creating org.apache.jmeter.gui.action.SelectTemplatesDialog
java.awt.HeadlessException
     [java] o.a.j.junit.JMeterTest Error creating org.apache.jmeter.gui.util.EscapeDialog
java.awt.HeadlessException
     [java] o.a.j.junit.JMeterTest Error creating org.apache.jmeter.gui.util.JSyntaxTextArea
java.awt.HeadlessException
     [java] ......................................E...E..............................................................................................................................................................................................................................................................................................................................................................................................................................................................................................................................................................................................................................................................................................................................................................................................................................................................................................................................................................................................................................................................................................................................................................................................................................................................................................................................................................................................................................................................................................................................................................................................................................................................................................................................................................................................................................................................................................................................................................................................................................................................................................................................................................................................................................................................................................................................................................................................................I...............................................................................................................................................................................................................................................
     [java] Time: 90.924
     [java] There were 2 failures:
     [java] 1) testMaven(org.apache.jmeter.JMeterVersionTest)
     [java] java.lang.AssertionError: Should have no names left: [jdom]. Check ApacheJMeter_parent.pom
     [java] 	at org.junit.Assert.fail(Assert.java:88)
     [java] 	at org.apache.jmeter.JMeterVersionTest.testMaven(JMeterVersionTest.java:197)
     [java] 	at sun.reflect.NativeMethodAccessorImpl.invoke0(Native Method)
     [java] 	at sun.reflect.NativeMethodAccessorImpl.invoke(NativeMethodAccessorImpl.java:57)
     [java] 	at sun.reflect.DelegatingMethodAccessorImpl.invoke(DelegatingMethodAccessorImpl.java:43)
     [java] 	at java.lang.reflect.Method.invoke(Method.java:606)
     [java] 	at org.junit.runners.model.FrameworkMethod$1.runReflectiveCall(FrameworkMethod.java:50)
     [java] 	at org.junit.internal.runners.model.ReflectiveCallable.run(ReflectiveCallable.java:12)
     [java] 	at org.junit.runners.model.FrameworkMethod.invokeExplosively(FrameworkMethod.java:47)
     [java] 	at org.junit.internal.runners.statements.InvokeMethod.evaluate(InvokeMethod.java:17)
     [java] 	at org.junit.internal.runners.statements.RunBefores.evaluate(RunBefores.java:26)
     [java] 	at org.junit.runners.ParentRunner.runLeaf(ParentRunner.java:325)
     [java] 	at org.junit.runners.BlockJUnit4ClassRunner.runChild(BlockJUnit4ClassRunner.java:78)
     [java] 	at org.junit.runners.BlockJUnit4ClassRunner.runChild(BlockJUnit4ClassRunner.java:57)
     [java] 	at org.junit.runners.ParentRunner$3.run(ParentRunner.java:290)
     [java] 	at org.junit.runners.ParentRunner$1.schedule(ParentRunner.java:71)
     [java] 	at org.junit.runners.ParentRunner.runChildren(ParentRunner.java:288)
     [java] 	at org.junit.runners.ParentRunner.access$000(ParentRunner.java:58)
     [java] 	at org.junit.runners.ParentRunner$2.evaluate(ParentRunner.java:268)
     [java] 	at org.junit.runners.ParentRunner.run(ParentRunner.java:363)
     [java] 	at org.junit.runners.Suite.runChild(Suite.java:128)
     [java] 	at org.junit.runners.Suite.runChild(Suite.java:27)
     [java] 	at org.junit.runners.ParentRunner$3.run(ParentRunner.java:290)
     [java] 	at org.junit.runners.ParentRunner$1.schedule(ParentRunner.java:71)
     [java] 	at org.junit.runners.ParentRunner.runChildren(ParentRunner.java:288)
     [java] 	at org.junit.runners.ParentRunner.access$000(ParentRunner.java:58)
     [java] 	at org.junit.runners.ParentRunner$2.evaluate(ParentRunner.java:268)
     [java] 	at org.junit.runners.ParentRunner.run(ParentRunner.java:363)
     [java] 	at org.junit.runner.JUnitCore.run(JUnitCore.java:137)
     [java] 	at org.junit.runner.JUnitCore.run(JUnitCore.java:115)
     [java] 	at org.apache.jorphan.test.AllTests.main(AllTests.java:212)
     [java] 2) testEclipse(org.apache.jmeter.JMeterVersionTest)
     [java] java.lang.AssertionError: Should have no names left: [jdom]. Check eclipse.classpath
     [java] 	at org.junit.Assert.fail(Assert.java:88)
     [java] 	at org.apache.jmeter.JMeterVersionTest.testEclipse(JMeterVersionTest.java:167)
     [java] 	at sun.reflect.NativeMethodAccessorImpl.invoke0(Native Method)
     [java] 	at sun.reflect.NativeMethodAccessorImpl.invoke(NativeMethodAccessorImpl.java:57)
     [java] 	at sun.reflect.DelegatingMethodAccessorImpl.invoke(DelegatingMethodAccessorImpl.java:43)
     [java] 	at java.lang.reflect.Method.invoke(Method.java:606)
     [java] 	at org.junit.runners.model.FrameworkMethod$1.runReflectiveCall(FrameworkMethod.java:50)
     [java] 	at org.junit.internal.runners.model.ReflectiveCallable.run(ReflectiveCallable.java:12)
     [java] 	at org.junit.runners.model.FrameworkMethod.invokeExplosively(FrameworkMethod.java:47)
     [java] 	at org.junit.internal.runners.statements.InvokeMethod.evaluate(InvokeMethod.java:17)
     [java] 	at org.junit.internal.runners.statements.RunBefores.evaluate(RunBefores.java:26)
     [java] 	at org.junit.runners.ParentRunner.runLeaf(ParentRunner.java:325)
     [java] 	at org.junit.runners.BlockJUnit4ClassRunner.runChild(BlockJUnit4ClassRunner.java:78)
     [java] 	at org.junit.runners.BlockJUnit4ClassRunner.runChild(BlockJUnit4ClassRunner.java:57)
     [java] 	at org.junit.runners.ParentRunner$3.run(ParentRunner.java:290)
     [java] 	at org.junit.runners.ParentRunner$1.schedule(ParentRunner.java:71)
     [java] 	at org.junit.runners.ParentRunner.runChildren(ParentRunner.java:288)
     [java] 	at org.junit.runners.ParentRunner.access$000(ParentRunner.java:58)
     [java] 	at org.junit.runners.ParentRunner$2.evaluate(ParentRunner.java:268)
     [java] 	at org.junit.runners.ParentRunner.run(ParentRunner.java:363)
     [java] 	at org.junit.runners.Suite.runChild(Suite.java:128)
     [java] 	at org.junit.runners.Suite.runChild(Suite.java:27)
     [java] 	at org.junit.runners.ParentRunner$3.run(ParentRunner.java:290)
     [java] 	at org.junit.runners.ParentRunner$1.schedule(ParentRunner.java:71)
     [java] 	at org.junit.runners.ParentRunner.runChildren(ParentRunner.java:288)
     [java] 	at org.junit.runners.ParentRunner.access$000(ParentRunner.java:58)
     [java] 	at org.junit.runners.ParentRunner$2.evaluate(ParentRunner.java:268)
     [java] 	at org.junit.runners.ParentRunner.run(ParentRunner.java:363)
     [java] 	at org.junit.runner.JUnitCore.run(JUnitCore.java:137)
     [java] 	at org.junit.runner.JUnitCore.run(JUnitCore.java:115)
     [java] 	at org.apache.jorphan.test.AllTests.main(AllTests.java:212)
     [java] 
     [java] FAILURES!!!
     [java] Tests run: 2598,  Failures: 2
     [java] 

BUILD FAILED
<https://builds.apache.org/job/JMeter-trunk/ws/trunk/build.xml>:2642: Java returned:
1

Total time: 3 minutes 55 seconds
Build step 'Invoke Ant' marked build as failure
[locks-and-latches] Releasing all the locks
[locks-and-latches] All the locks released
Archiving artifacts

Mime
View raw message