jmeter-dev mailing list archives

Site index · List index
Message view « Date » · « Thread »
Top « Date » · « Thread »
From Apache Jenkins Server <jenk...@builds.apache.org>
Subject Build failed in Jenkins: JMeter-trunk #6915
Date Fri, 28 Sep 2018 17:41:21 GMT
See <https://builds.apache.org/job/JMeter-trunk/6915/display/redirect>

------------------------------------------
[...truncated 4.14 KB...]
	at hudson.scm.subversion.CheckoutUpdater$1.perform(CheckoutUpdater.java:121)
Also:   hudson.remoting.Channel$CallSiteStackTrace: Remote call to H31
		at hudson.remoting.Channel.attachCallSiteStackTrace(Channel.java:1741)
		at hudson.remoting.UserRequest$ExceptionResponse.retrieve(UserRequest.java:357)
		at hudson.remoting.Channel.call(Channel.java:955)
		at hudson.FilePath.act(FilePath.java:1036)
		at hudson.FilePath.act(FilePath.java:1025)
		at hudson.scm.SubversionSCM.checkout(SubversionSCM.java:937)
		at hudson.scm.SubversionSCM.checkout(SubversionSCM.java:864)
		at hudson.scm.SCM.checkout(SCM.java:504)
		at hudson.model.AbstractProject.checkout(AbstractProject.java:1208)
		at hudson.model.AbstractBuild$AbstractBuildExecution.defaultCheckout(AbstractBuild.java:574)
		at jenkins.scm.SCMCheckoutStrategy.checkout(SCMCheckoutStrategy.java:86)
		at hudson.model.AbstractBuild$AbstractBuildExecution.run(AbstractBuild.java:499)
		at hudson.model.Run.execute(Run.java:1794)
		at hudson.model.FreeStyleBuild.run(FreeStyleBuild.java:43)
		at hudson.model.ResourceController.execute(ResourceController.java:97)
		at hudson.model.Executor.run(Executor.java:429)
Caused: java.io.IOException: Failed to check out http://svn.apache.org/repos/asf/jmeter/trunk
	at hudson.scm.subversion.CheckoutUpdater$1.perform(CheckoutUpdater.java:132)
	at hudson.scm.subversion.WorkspaceUpdater$UpdateTask.delegateTo(WorkspaceUpdater.java:168)
	at hudson.scm.subversion.WorkspaceUpdater$UpdateTask.delegateTo(WorkspaceUpdater.java:176)
	at hudson.scm.subversion.UpdateUpdater$TaskImpl.perform(UpdateUpdater.java:134)
	at hudson.scm.subversion.WorkspaceUpdater$UpdateTask.delegateTo(WorkspaceUpdater.java:168)
	at hudson.scm.SubversionSCM$CheckOutTask.perform(SubversionSCM.java:1041)
	at hudson.scm.SubversionSCM$CheckOutTask.invoke(SubversionSCM.java:1017)
	at hudson.scm.SubversionSCM$CheckOutTask.invoke(SubversionSCM.java:990)
	at hudson.FilePath$FileCallableWrapper.call(FilePath.java:2918)
	at hudson.remoting.UserRequest.perform(UserRequest.java:212)
	at hudson.remoting.UserRequest.perform(UserRequest.java:54)
	at hudson.remoting.Request$2.run(Request.java:369)
	at hudson.remoting.InterceptingExecutorService$1.call(InterceptingExecutorService.java:72)
	at java.util.concurrent.FutureTask.run(FutureTask.java:266)
	at java.util.concurrent.ThreadPoolExecutor.runWorker(ThreadPoolExecutor.java:1142)
	at java.util.concurrent.ThreadPoolExecutor$Worker.run(ThreadPoolExecutor.java:617)
	at java.lang.Thread.run(Thread.java:748)
Caused: java.io.IOException: remote file operation failed: <https://builds.apache.org/job/JMeter-trunk/ws/>
at hudson.remoting.Channel@3bc2a34f:H31
	at hudson.FilePath.act(FilePath.java:1043)
	at hudson.FilePath.act(FilePath.java:1025)
	at hudson.scm.SubversionSCM.checkout(SubversionSCM.java:937)
	at hudson.scm.SubversionSCM.checkout(SubversionSCM.java:864)
	at hudson.scm.SCM.checkout(SCM.java:504)
	at hudson.model.AbstractProject.checkout(AbstractProject.java:1208)
	at hudson.model.AbstractBuild$AbstractBuildExecution.defaultCheckout(AbstractBuild.java:574)
	at jenkins.scm.SCMCheckoutStrategy.checkout(SCMCheckoutStrategy.java:86)
	at hudson.model.AbstractBuild$AbstractBuildExecution.run(AbstractBuild.java:499)
	at hudson.model.Run.execute(Run.java:1794)
	at hudson.model.FreeStyleBuild.run(FreeStyleBuild.java:43)
	at hudson.model.ResourceController.execute(ResourceController.java:97)
	at hudson.model.Executor.run(Executor.java:429)
Retrying after 10 seconds
Checking out a fresh workspace because there's no workspace at <https://builds.apache.org/job/JMeter-trunk/ws/trunk>
Cleaning local Directory trunk
Checking out http://svn.apache.org/repos/asf/jmeter/trunk at revision '2018-09-28T17:40:51.506
+0000'
ERROR: Failed to check out http://svn.apache.org/repos/asf/jmeter/trunk
org.tmatesoft.svn.core.SVNException: svn: E204899: Unable to make directories
	at org.tmatesoft.svn.core.internal.wc.SVNErrorManager.error(SVNErrorManager.java:70)
	at org.tmatesoft.svn.core.internal.wc.SVNErrorManager.error(SVNErrorManager.java:57)
	at org.tmatesoft.svn.core.internal.wc.SVNFileUtil.ensureDirectoryExists(SVNFileUtil.java:1575)
	at org.tmatesoft.svn.core.internal.wc17.SVNWCContext.initWC(SVNWCContext.java:5011)
	at org.tmatesoft.svn.core.internal.wc17.SVNWCContext.initializeWC(SVNWCContext.java:4966)
	at org.tmatesoft.svn.core.internal.wc2.ng.SvnNgAbstractUpdate.checkout(SvnNgAbstractUpdate.java:871)
	at org.tmatesoft.svn.core.internal.wc2.ng.SvnNgCheckout.run(SvnNgCheckout.java:26)
	at org.tmatesoft.svn.core.internal.wc2.ng.SvnNgCheckout.run(SvnNgCheckout.java:11)
	at org.tmatesoft.svn.core.internal.wc2.ng.SvnNgOperationRunner.run(SvnNgOperationRunner.java:20)
	at org.tmatesoft.svn.core.internal.wc2.SvnOperationRunner.run(SvnOperationRunner.java:21)
	at org.tmatesoft.svn.core.wc2.SvnOperationFactory.run(SvnOperationFactory.java:1239)
	at org.tmatesoft.svn.core.wc2.SvnOperation.run(SvnOperation.java:294)
	at hudson.scm.subversion.CheckoutUpdater$1.perform(CheckoutUpdater.java:121)
	at hudson.scm.subversion.WorkspaceUpdater$UpdateTask.delegateTo(WorkspaceUpdater.java:168)
	at hudson.scm.subversion.WorkspaceUpdater$UpdateTask.delegateTo(WorkspaceUpdater.java:176)
	at hudson.scm.subversion.UpdateUpdater$TaskImpl.perform(UpdateUpdater.java:134)
	at hudson.scm.subversion.WorkspaceUpdater$UpdateTask.delegateTo(WorkspaceUpdater.java:168)
	at hudson.scm.SubversionSCM$CheckOutTask.perform(SubversionSCM.java:1041)
	at hudson.scm.SubversionSCM$CheckOutTask.invoke(SubversionSCM.java:1017)
	at hudson.scm.SubversionSCM$CheckOutTask.invoke(SubversionSCM.java:990)
	at hudson.FilePath$FileCallableWrapper.call(FilePath.java:2918)
	at hudson.remoting.UserRequest.perform(UserRequest.java:212)
	at hudson.remoting.UserRequest.perform(UserRequest.java:54)
	at hudson.remoting.Request$2.run(Request.java:369)
	at hudson.remoting.InterceptingExecutorService$1.call(InterceptingExecutorService.java:72)
	at java.util.concurrent.FutureTask.run(FutureTask.java:266)
	at java.util.concurrent.ThreadPoolExecutor.runWorker(ThreadPoolExecutor.java:1142)
	at java.util.concurrent.ThreadPoolExecutor$Worker.run(ThreadPoolExecutor.java:617)
	at java.lang.Thread.run(Thread.java:748)
org.tmatesoft.svn.core.SVNException: svn: E204899: Unable to make directories
	at org.tmatesoft.svn.core.internal.wc.SVNErrorManager.error(SVNErrorManager.java:70)
	at org.tmatesoft.svn.core.internal.wc.SVNErrorManager.error(SVNErrorManager.java:57)
	at org.tmatesoft.svn.core.internal.wc.SVNFileUtil.ensureDirectoryExists(SVNFileUtil.java:1575)
	at org.tmatesoft.svn.core.internal.wc17.SVNWCContext.initWC(SVNWCContext.java:5011)
	at org.tmatesoft.svn.core.internal.wc17.SVNWCContext.initializeWC(SVNWCContext.java:4966)
	at org.tmatesoft.svn.core.internal.wc2.ng.SvnNgAbstractUpdate.checkout(SvnNgAbstractUpdate.java:871)
	at org.tmatesoft.svn.core.internal.wc2.ng.SvnNgCheckout.run(SvnNgCheckout.java:26)
	at org.tmatesoft.svn.core.internal.wc2.ng.SvnNgCheckout.run(SvnNgCheckout.java:11)
	at org.tmatesoft.svn.core.internal.wc2.ng.SvnNgOperationRunner.run(SvnNgOperationRunner.java:20)
	at org.tmatesoft.svn.core.internal.wc2.SvnOperationRunner.run(SvnOperationRunner.java:21)
	at org.tmatesoft.svn.core.wc2.SvnOperationFactory.run(SvnOperationFactory.java:1239)
	at org.tmatesoft.svn.core.wc2.SvnOperation.run(SvnOperation.java:294)
	at hudson.scm.subversion.CheckoutUpdater$1.perform(CheckoutUpdater.java:121)
Also:   hudson.remoting.Channel$CallSiteStackTrace: Remote call to H31
		at hudson.remoting.Channel.attachCallSiteStackTrace(Channel.java:1741)
		at hudson.remoting.UserRequest$ExceptionResponse.retrieve(UserRequest.java:357)
		at hudson.remoting.Channel.call(Channel.java:955)
		at hudson.FilePath.act(FilePath.java:1036)
		at hudson.FilePath.act(FilePath.java:1025)
		at hudson.scm.SubversionSCM.checkout(SubversionSCM.java:937)
		at hudson.scm.SubversionSCM.checkout(SubversionSCM.java:864)
		at hudson.scm.SCM.checkout(SCM.java:504)
		at hudson.model.AbstractProject.checkout(AbstractProject.java:1208)
		at hudson.model.AbstractBuild$AbstractBuildExecution.defaultCheckout(AbstractBuild.java:574)
		at jenkins.scm.SCMCheckoutStrategy.checkout(SCMCheckoutStrategy.java:86)
		at hudson.model.AbstractBuild$AbstractBuildExecution.run(AbstractBuild.java:499)
		at hudson.model.Run.execute(Run.java:1794)
		at hudson.model.FreeStyleBuild.run(FreeStyleBuild.java:43)
		at hudson.model.ResourceController.execute(ResourceController.java:97)
		at hudson.model.Executor.run(Executor.java:429)
Caused: java.io.IOException: Failed to check out http://svn.apache.org/repos/asf/jmeter/trunk
	at hudson.scm.subversion.CheckoutUpdater$1.perform(CheckoutUpdater.java:132)
	at hudson.scm.subversion.WorkspaceUpdater$UpdateTask.delegateTo(WorkspaceUpdater.java:168)
	at hudson.scm.subversion.WorkspaceUpdater$UpdateTask.delegateTo(WorkspaceUpdater.java:176)
	at hudson.scm.subversion.UpdateUpdater$TaskImpl.perform(UpdateUpdater.java:134)
	at hudson.scm.subversion.WorkspaceUpdater$UpdateTask.delegateTo(WorkspaceUpdater.java:168)
	at hudson.scm.SubversionSCM$CheckOutTask.perform(SubversionSCM.java:1041)
	at hudson.scm.SubversionSCM$CheckOutTask.invoke(SubversionSCM.java:1017)
	at hudson.scm.SubversionSCM$CheckOutTask.invoke(SubversionSCM.java:990)
	at hudson.FilePath$FileCallableWrapper.call(FilePath.java:2918)
	at hudson.remoting.UserRequest.perform(UserRequest.java:212)
	at hudson.remoting.UserRequest.perform(UserRequest.java:54)
	at hudson.remoting.Request$2.run(Request.java:369)
	at hudson.remoting.InterceptingExecutorService$1.call(InterceptingExecutorService.java:72)
	at java.util.concurrent.FutureTask.run(FutureTask.java:266)
	at java.util.concurrent.ThreadPoolExecutor.runWorker(ThreadPoolExecutor.java:1142)
	at java.util.concurrent.ThreadPoolExecutor$Worker.run(ThreadPoolExecutor.java:617)
	at java.lang.Thread.run(Thread.java:748)
Caused: java.io.IOException: remote file operation failed: <https://builds.apache.org/job/JMeter-trunk/ws/>
at hudson.remoting.Channel@3bc2a34f:H31
	at hudson.FilePath.act(FilePath.java:1043)
	at hudson.FilePath.act(FilePath.java:1025)
	at hudson.scm.SubversionSCM.checkout(SubversionSCM.java:937)
	at hudson.scm.SubversionSCM.checkout(SubversionSCM.java:864)
	at hudson.scm.SCM.checkout(SCM.java:504)
	at hudson.model.AbstractProject.checkout(AbstractProject.java:1208)
	at hudson.model.AbstractBuild$AbstractBuildExecution.defaultCheckout(AbstractBuild.java:574)
	at jenkins.scm.SCMCheckoutStrategy.checkout(SCMCheckoutStrategy.java:86)
	at hudson.model.AbstractBuild$AbstractBuildExecution.run(AbstractBuild.java:499)
	at hudson.model.Run.execute(Run.java:1794)
	at hudson.model.FreeStyleBuild.run(FreeStyleBuild.java:43)
	at hudson.model.ResourceController.execute(ResourceController.java:97)
	at hudson.model.Executor.run(Executor.java:429)
Retrying after 10 seconds
Checking out a fresh workspace because there's no workspace at <https://builds.apache.org/job/JMeter-trunk/ws/trunk>
Cleaning local Directory trunk
Checking out http://svn.apache.org/repos/asf/jmeter/trunk at revision '2018-09-28T17:40:51.506
+0000'
ERROR: Failed to check out http://svn.apache.org/repos/asf/jmeter/trunk
org.tmatesoft.svn.core.SVNException: svn: E204899: Unable to make directories
	at org.tmatesoft.svn.core.internal.wc.SVNErrorManager.error(SVNErrorManager.java:70)
	at org.tmatesoft.svn.core.internal.wc.SVNErrorManager.error(SVNErrorManager.java:57)
	at org.tmatesoft.svn.core.internal.wc.SVNFileUtil.ensureDirectoryExists(SVNFileUtil.java:1575)
	at org.tmatesoft.svn.core.internal.wc17.SVNWCContext.initWC(SVNWCContext.java:5011)
	at org.tmatesoft.svn.core.internal.wc17.SVNWCContext.initializeWC(SVNWCContext.java:4966)
	at org.tmatesoft.svn.core.internal.wc2.ng.SvnNgAbstractUpdate.checkout(SvnNgAbstractUpdate.java:871)
	at org.tmatesoft.svn.core.internal.wc2.ng.SvnNgCheckout.run(SvnNgCheckout.java:26)
	at org.tmatesoft.svn.core.internal.wc2.ng.SvnNgCheckout.run(SvnNgCheckout.java:11)
	at org.tmatesoft.svn.core.internal.wc2.ng.SvnNgOperationRunner.run(SvnNgOperationRunner.java:20)
	at org.tmatesoft.svn.core.internal.wc2.SvnOperationRunner.run(SvnOperationRunner.java:21)
	at org.tmatesoft.svn.core.wc2.SvnOperationFactory.run(SvnOperationFactory.java:1239)
	at org.tmatesoft.svn.core.wc2.SvnOperation.run(SvnOperation.java:294)
	at hudson.scm.subversion.CheckoutUpdater$1.perform(CheckoutUpdater.java:121)
	at hudson.scm.subversion.WorkspaceUpdater$UpdateTask.delegateTo(WorkspaceUpdater.java:168)
	at hudson.scm.subversion.WorkspaceUpdater$UpdateTask.delegateTo(WorkspaceUpdater.java:176)
	at hudson.scm.subversion.UpdateUpdater$TaskImpl.perform(UpdateUpdater.java:134)
	at hudson.scm.subversion.WorkspaceUpdater$UpdateTask.delegateTo(WorkspaceUpdater.java:168)
	at hudson.scm.SubversionSCM$CheckOutTask.perform(SubversionSCM.java:1041)
	at hudson.scm.SubversionSCM$CheckOutTask.invoke(SubversionSCM.java:1017)
	at hudson.scm.SubversionSCM$CheckOutTask.invoke(SubversionSCM.java:990)
	at hudson.FilePath$FileCallableWrapper.call(FilePath.java:2918)
	at hudson.remoting.UserRequest.perform(UserRequest.java:212)
	at hudson.remoting.UserRequest.perform(UserRequest.java:54)
	at hudson.remoting.Request$2.run(Request.java:369)
	at hudson.remoting.InterceptingExecutorService$1.call(InterceptingExecutorService.java:72)
	at java.util.concurrent.FutureTask.run(FutureTask.java:266)
	at java.util.concurrent.ThreadPoolExecutor.runWorker(ThreadPoolExecutor.java:1142)
	at java.util.concurrent.ThreadPoolExecutor$Worker.run(ThreadPoolExecutor.java:617)
	at java.lang.Thread.run(Thread.java:748)
org.tmatesoft.svn.core.SVNException: svn: E204899: Unable to make directories
	at org.tmatesoft.svn.core.internal.wc.SVNErrorManager.error(SVNErrorManager.java:70)
	at org.tmatesoft.svn.core.internal.wc.SVNErrorManager.error(SVNErrorManager.java:57)
	at org.tmatesoft.svn.core.internal.wc.SVNFileUtil.ensureDirectoryExists(SVNFileUtil.java:1575)
	at org.tmatesoft.svn.core.internal.wc17.SVNWCContext.initWC(SVNWCContext.java:5011)
	at org.tmatesoft.svn.core.internal.wc17.SVNWCContext.initializeWC(SVNWCContext.java:4966)
	at org.tmatesoft.svn.core.internal.wc2.ng.SvnNgAbstractUpdate.checkout(SvnNgAbstractUpdate.java:871)
	at org.tmatesoft.svn.core.internal.wc2.ng.SvnNgCheckout.run(SvnNgCheckout.java:26)
	at org.tmatesoft.svn.core.internal.wc2.ng.SvnNgCheckout.run(SvnNgCheckout.java:11)
	at org.tmatesoft.svn.core.internal.wc2.ng.SvnNgOperationRunner.run(SvnNgOperationRunner.java:20)
	at org.tmatesoft.svn.core.internal.wc2.SvnOperationRunner.run(SvnOperationRunner.java:21)
	at org.tmatesoft.svn.core.wc2.SvnOperationFactory.run(SvnOperationFactory.java:1239)
	at org.tmatesoft.svn.core.wc2.SvnOperation.run(SvnOperation.java:294)
	at hudson.scm.subversion.CheckoutUpdater$1.perform(CheckoutUpdater.java:121)
Also:   hudson.remoting.Channel$CallSiteStackTrace: Remote call to H31
		at hudson.remoting.Channel.attachCallSiteStackTrace(Channel.java:1741)
		at hudson.remoting.UserRequest$ExceptionResponse.retrieve(UserRequest.java:357)
		at hudson.remoting.Channel.call(Channel.java:955)
		at hudson.FilePath.act(FilePath.java:1036)
		at hudson.FilePath.act(FilePath.java:1025)
		at hudson.scm.SubversionSCM.checkout(SubversionSCM.java:937)
		at hudson.scm.SubversionSCM.checkout(SubversionSCM.java:864)
		at hudson.scm.SCM.checkout(SCM.java:504)
		at hudson.model.AbstractProject.checkout(AbstractProject.java:1208)
		at hudson.model.AbstractBuild$AbstractBuildExecution.defaultCheckout(AbstractBuild.java:574)
		at jenkins.scm.SCMCheckoutStrategy.checkout(SCMCheckoutStrategy.java:86)
		at hudson.model.AbstractBuild$AbstractBuildExecution.run(AbstractBuild.java:499)
		at hudson.model.Run.execute(Run.java:1794)
		at hudson.model.FreeStyleBuild.run(FreeStyleBuild.java:43)
		at hudson.model.ResourceController.execute(ResourceController.java:97)
		at hudson.model.Executor.run(Executor.java:429)
Caused: java.io.IOException: Failed to check out http://svn.apache.org/repos/asf/jmeter/trunk
	at hudson.scm.subversion.CheckoutUpdater$1.perform(CheckoutUpdater.java:132)
	at hudson.scm.subversion.WorkspaceUpdater$UpdateTask.delegateTo(WorkspaceUpdater.java:168)
	at hudson.scm.subversion.WorkspaceUpdater$UpdateTask.delegateTo(WorkspaceUpdater.java:176)
	at hudson.scm.subversion.UpdateUpdater$TaskImpl.perform(UpdateUpdater.java:134)
	at hudson.scm.subversion.WorkspaceUpdater$UpdateTask.delegateTo(WorkspaceUpdater.java:168)
	at hudson.scm.SubversionSCM$CheckOutTask.perform(SubversionSCM.java:1041)
	at hudson.scm.SubversionSCM$CheckOutTask.invoke(SubversionSCM.java:1017)
	at hudson.scm.SubversionSCM$CheckOutTask.invoke(SubversionSCM.java:990)
	at hudson.FilePath$FileCallableWrapper.call(FilePath.java:2918)
	at hudson.remoting.UserRequest.perform(UserRequest.java:212)
	at hudson.remoting.UserRequest.perform(UserRequest.java:54)
	at hudson.remoting.Request$2.run(Request.java:369)
	at hudson.remoting.InterceptingExecutorService$1.call(InterceptingExecutorService.java:72)
	at java.util.concurrent.FutureTask.run(FutureTask.java:266)
	at java.util.concurrent.ThreadPoolExecutor.runWorker(ThreadPoolExecutor.java:1142)
	at java.util.concurrent.ThreadPoolExecutor$Worker.run(ThreadPoolExecutor.java:617)
	at java.lang.Thread.run(Thread.java:748)
Caused: java.io.IOException: remote file operation failed: <https://builds.apache.org/job/JMeter-trunk/ws/>
at hudson.remoting.Channel@3bc2a34f:H31
	at hudson.FilePath.act(FilePath.java:1043)
	at hudson.FilePath.act(FilePath.java:1025)
	at hudson.scm.SubversionSCM.checkout(SubversionSCM.java:937)
	at hudson.scm.SubversionSCM.checkout(SubversionSCM.java:864)
	at hudson.scm.SCM.checkout(SCM.java:504)
	at hudson.model.AbstractProject.checkout(AbstractProject.java:1208)
	at hudson.model.AbstractBuild$AbstractBuildExecution.defaultCheckout(AbstractBuild.java:574)
	at jenkins.scm.SCMCheckoutStrategy.checkout(SCMCheckoutStrategy.java:86)
	at hudson.model.AbstractBuild$AbstractBuildExecution.run(AbstractBuild.java:499)
	at hudson.model.Run.execute(Run.java:1794)
	at hudson.model.FreeStyleBuild.run(FreeStyleBuild.java:43)
	at hudson.model.ResourceController.execute(ResourceController.java:97)
	at hudson.model.Executor.run(Executor.java:429)
Archiving artifacts
Recording test results
ERROR: Step ?Publish JUnit test result report? failed: No test report files were found. Configuration
error?

Mime
View raw message