jmeter-dev mailing list archives

Site index · List index
Message view « Date » · « Thread »
Top « Date » · « Thread »
From Apache Jenkins Server <jenk...@builds.apache.org>
Subject Build failed in Jenkins: JMeter-trunk #7285
Date Sat, 03 Aug 2019 14:58:14 GMT
See <https://builds.apache.org/job/JMeter-trunk/7285/display/redirect?page=changes>

Changes:

[felix.schumacher] Remove useless method call

[felix.schumacher] Check for result of mkdir

[felix.schumacher] Use long arithmetic all along

[felix.schumacher] spelchack

[sitnikov.vladimir] Fix JMeterTestUtils#setupJMeterHome

[sitnikov.vladimir] Remove system.out.println from

[sitnikov.vladimir] AllTests: log classpath only when jmeter.test.log.classpath=true

[sitnikov.vladimir] Allow to skip SpotBugs failures via -PignoreSpotBugsFailures

[sitnikov.vladimir] Increase timeouts in SamplingNamingTest to reduce fails

[sitnikov.vladimir] Remove unused import from TestHTMLParser

[sitnikov.vladimir] JMeterTestCase: log classpath only when jmeter.test.log.classpath=true

------------------------------------------
[...truncated 574 B...]
Fetching upstream changes from https://gitbox.apache.org/repos/asf/jmeter.git
 > git --version # timeout=10
 > git fetch --tags --progress https://gitbox.apache.org/repos/asf/jmeter.git +refs/heads/*:refs/remotes/origin/*
 > git rev-parse refs/remotes/origin/master^{commit} # timeout=10
 > git rev-parse refs/remotes/origin/origin/master^{commit} # timeout=10
Checking out Revision 7da43742105588cf4b818aceb3d634cb514beeae (refs/remotes/origin/master)
 > git config core.sparsecheckout # timeout=10
 > git checkout -f 7da43742105588cf4b818aceb3d634cb514beeae
Commit message: "JMeterTestCase: log classpath only when jmeter.test.log.classpath=true property
is present"
 > git rev-list --no-walk 17fc0d3207c01666dbb870cf6c8c6aee7c280911 # timeout=10
[locks-and-latches] Checking to see if we really have the locks
[locks-and-latches] Have all the locks, build can start
Injecting SonarQube environment variables using the configuration: ASF Sonar Analysis
[Gradle] - Launching build.
[JMeter-trunk] $ <https://builds.apache.org/job/JMeter-trunk/ws/gradlew> -Djava.awt.headless=true
-Pspotbugs=true -PCI=true check assemble sonarqube
To honour the JVM settings for this build a new JVM will be forked. Please consider using
the daemon: https://docs.gradle.org/5.5.1/userguide/gradle_daemon.html.
Daemon will be stopped at the end of the build stopping after processing
> Task :buildSrc:compileKotlin NO-SOURCE
> Task :buildSrc:compileJava NO-SOURCE
> Task :buildSrc:compileGroovy NO-SOURCE
> Task :buildSrc:pluginDescriptors UP-TO-DATE
> Task :buildSrc:processResources NO-SOURCE
> Task :buildSrc:classes UP-TO-DATE
> Task :buildSrc:inspectClassesForKotlinIC UP-TO-DATE
> Task :buildSrc:jar UP-TO-DATE
> Task :buildSrc:assemble UP-TO-DATE
> Task :buildSrc:compileTestKotlin NO-SOURCE
> Task :buildSrc:compileTestJava NO-SOURCE
> Task :buildSrc:compileTestGroovy NO-SOURCE
> Task :buildSrc:processTestResources NO-SOURCE
> Task :buildSrc:testClasses UP-TO-DATE
> Task :buildSrc:validateTaskProperties UP-TO-DATE
> Task :buildSrc:batchtest:compileKotlin UP-TO-DATE
> Task :buildSrc:batchtest:compileJava NO-SOURCE
> Task :buildSrc:batchtest:pluginDescriptors UP-TO-DATE
> Task :buildSrc:batchtest:processResources UP-TO-DATE
> Task :buildSrc:batchtest:classes UP-TO-DATE
> Task :buildSrc:batchtest:inspectClassesForKotlinIC UP-TO-DATE
> Task :buildSrc:batchtest:jar UP-TO-DATE
> Task :buildSrc:batchtest:assemble UP-TO-DATE
> Task :buildSrc:batchtest:compileTestKotlin NO-SOURCE
> Task :buildSrc:batchtest:pluginUnderTestMetadata UP-TO-DATE
> Task :buildSrc:pluginUnderTestMetadata UP-TO-DATE
> Task :buildSrc:batchtest:compileTestJava NO-SOURCE
> Task :buildSrc:batchtest:processTestResources NO-SOURCE
> Task :buildSrc:batchtest:testClasses UP-TO-DATE
> Task :buildSrc:test NO-SOURCE
> Task :buildSrc:check UP-TO-DATE
> Task :buildSrc:build UP-TO-DATE
> Task :buildSrc:batchtest:test NO-SOURCE
> Task :buildSrc:batchtest:validateTaskProperties UP-TO-DATE
> Task :buildSrc:batchtest:check UP-TO-DATE
> Task :buildSrc:batchtest:build UP-TO-DATE

> Configure project :
Building JMeter 5.2.0-SNAPSHOT

> Task :src:bom:check UP-TO-DATE
> Task :src:config:compileJava NO-SOURCE
> Task :src:protocol:tcp:processResources NO-SOURCE
> Task :src:protocol:ftp:processResources NO-SOURCE
> Task :src:protocol:ldap:processResources NO-SOURCE
> Task :compileJava NO-SOURCE
> Task :src:protocol:junit:processResources NO-SOURCE
> Task :src:protocol:native:processResources NO-SOURCE
> Task :src:protocol:mail:processResources UP-TO-DATE
> Task :src:dist-check:processResources NO-SOURCE
> Task :src:dist:processResources NO-SOURCE
> Task :src:config:processResources NO-SOURCE
> Task :src:protocol:ftp:processTestResources NO-SOURCE
> Task :src:protocol:tcp:processTestResources NO-SOURCE
> Task :src:protocol:jms:processResources NO-SOURCE
> Task :src:protocol:junit-sample:processResources NO-SOURCE
> Task :src:protocol:native:processTestResources NO-SOURCE
> Task :src:config:classes UP-TO-DATE
> Task :src:protocol:java:processResources UP-TO-DATE
> Task :src:release:compileJava NO-SOURCE
> Task :src:generator:processResources NO-SOURCE
> Task :src:protocol:junit:processTestResources NO-SOURCE
> Task :src:protocol:compileJava NO-SOURCE
> Task :src:protocol:mongodb:processResources UP-TO-DATE
> Task :src:functions:processResources UP-TO-DATE
> Task :src:dist:processTestResources NO-SOURCE
> Task :src:protocol:mail:processTestResources NO-SOURCE
> Task :processResources NO-SOURCE
> Task :src:config:checkstyleMain NO-SOURCE
> Task :src:licenses:compileJava NO-SOURCE
> Task :src:protocol:junit-sample:processTestResources NO-SOURCE
> Task :src:bshclient:compileJava UP-TO-DATE
> Task :src:launcher:compileJava UP-TO-DATE
> Task :src:generator:processTestResources NO-SOURCE
> Task :src:bom:assemble UP-TO-DATE
> Task :src:licenses:processResources NO-SOURCE
> Task :src:licenses:classes UP-TO-DATE
> Task :src:protocol:processResources NO-SOURCE
> Task :src:release:processResources NO-SOURCE
> Task :src:dist-check:processTestResources UP-TO-DATE
> Task :src:config:compileTestJava NO-SOURCE
> Task :src:licenses:checkstyleMain NO-SOURCE
> Task :src:bshclient:processResources NO-SOURCE
> Task :src:protocol:classes UP-TO-DATE
> Task :classes UP-TO-DATE
> Task :src:dist:preparePropertiesbuildPrintableDoc UP-TO-DATE
> Task :src:bshclient:classes UP-TO-DATE
> Task :src:protocol:mongodb:processTestResources NO-SOURCE
> Task :src:examples:processResources UP-TO-DATE
> Task :src:launcher:processResources UP-TO-DATE
> Task :src:protocol:java:processTestResources NO-SOURCE
> Task :src:protocol:http:processResources UP-TO-DATE
> Task :checkstyleMain NO-SOURCE
> Task :src:examples:processTestResources NO-SOURCE
> Task :src:protocol:ldap:processTestResources NO-SOURCE
> Task :src:protocol:jms:processTestResources UP-TO-DATE
> Task :src:licenses:compileTestJava NO-SOURCE
> Task :src:protocol:checkstyleMain NO-SOURCE
> Task :src:config:processTestResources NO-SOURCE
> Task :src:release:classes UP-TO-DATE
> Task :src:functions:processTestResources UP-TO-DATE
> Task :src:release:checkstyleMain NO-SOURCE
> Task :src:config:testClasses UP-TO-DATE
> Task :src:licenses:processTestResources NO-SOURCE
> Task :src:launcher:classes UP-TO-DATE
> Task :src:protocol:compileTestJava NO-SOURCE
> Task :compileTestJava NO-SOURCE
> Task :src:licenses:testClasses UP-TO-DATE
> Task :src:config:checkstyleTest NO-SOURCE
> Task :src:protocol:jdbc:processResources UP-TO-DATE
> Task :src:config:spotbugsMain NO-SOURCE
> Task :src:release:compileTestJava NO-SOURCE
> Task :src:licenses:checkstyleTest NO-SOURCE
> Task :processTestResources NO-SOURCE
> Task :src:config:spotbugsTest NO-SOURCE
> Task :testClasses UP-TO-DATE
> Task :src:licenses:spotbugsMain NO-SOURCE
> Task :src:release:processTestResources NO-SOURCE
> Task :src:launcher:jar UP-TO-DATE
> Task :checkstyleTest NO-SOURCE
> Task :src:protocol:processTestResources NO-SOURCE
> Task :src:release:testClasses UP-TO-DATE
> Task :src:protocol:testClasses UP-TO-DATE
> Task :src:protocol:jdbc:processTestResources NO-SOURCE
> Task :src:config:test NO-SOURCE
> Task :src:licenses:spotbugsTest NO-SOURCE
> Task :src:protocol:checkstyleTest NO-SOURCE
> Task :src:config:check UP-TO-DATE
> Task :src:licenses:test NO-SOURCE
> Task :src:release:checkstyleTest NO-SOURCE
> Task :src:licenses:check UP-TO-DATE
> Task :src:release:spotbugsMain NO-SOURCE
> Task :src:protocol:spotbugsMain NO-SOURCE
> Task :src:release:spotbugsTest NO-SOURCE
> Task :src:protocol:spotbugsTest NO-SOURCE
> Task :src:protocol:http:processTestResources UP-TO-DATE
> Task :src:release:test NO-SOURCE
> Task :src:protocol:test NO-SOURCE
> Task :src:release:check UP-TO-DATE
> Task :src:protocol:check UP-TO-DATE
> Task :src:bshclient:checkstyleMain UP-TO-DATE
> Task :src:bshclient:compileTestJava NO-SOURCE
> Task :src:bshclient:processTestResources NO-SOURCE
> Task :src:bshclient:testClasses UP-TO-DATE
> Task :src:protocol:jar UP-TO-DATE
> Task :src:release:jar UP-TO-DATE
> Task :src:launcher:checkstyleMain UP-TO-DATE
> Task :src:core:versionClass
> Task :src:protocol:assemble UP-TO-DATE
> Task :src:licenses:gatherSourceLicenses UP-TO-DATE
> Task :src:release:assemble UP-TO-DATE
> Task :src:bshclient:checkstyleTest NO-SOURCE
> Task :src:launcher:compileTestJava NO-SOURCE
> Task :src:licenses:renderLicenseForSource UP-TO-DATE
> Task :src:launcher:processTestResources NO-SOURCE
> Task :src:dist:buildPrintableDoc UP-TO-DATE
> Task :src:licenses:jar UP-TO-DATE
> Task :src:licenses:assemble UP-TO-DATE
> Task :src:launcher:testClasses UP-TO-DATE
> Task :src:dist-check:populateLibs
> Task :src:components:processResources UP-TO-DATE
> Task :src:components:processTestResources UP-TO-DATE
> Task :src:launcher:checkstyleTest NO-SOURCE
> Task :src:launcher:spotbugsMain UP-TO-DATE
> Task :src:launcher:spotbugsTest NO-SOURCE
> Task :src:launcher:test NO-SOURCE
> Task :src:launcher:check UP-TO-DATE
> Task :src:launcher:assemble UP-TO-DATE
> Task :src:core:processResources UP-TO-DATE
> Task :src:core:processTestResources UP-TO-DATE
> Task :src:config:renderLicenseForSourceCopySpec
> Task :src:dist:renderLicenseForSourceCopySpec
> Task :src:config:jar UP-TO-DATE
> Task :src:config:assemble UP-TO-DATE
> Task :gitProps
> Task :spotbugsMain NO-SOURCE
> Task :spotbugsTest NO-SOURCE
> Task :test NO-SOURCE
> Task :jar UP-TO-DATE
> Task :assemble UP-TO-DATE
> Task :src:jorphan:compileJava
> Task :src:jorphan:compileGroovy NO-SOURCE
> Task :src:jorphan:processResources UP-TO-DATE
> Task :src:jorphan:classes
> Task :src:jorphan:jar
> Task :src:jorphan:compileTestJava UP-TO-DATE
> Task :rat
> Task :check
> Task :src:jorphan:compileTestGroovy
> Task :src:jorphan:processTestResources NO-SOURCE
> Task :src:jorphan:testClasses
> Task :src:jorphan:testJar UP-TO-DATE
> Task :src:bshclient:spotbugsMain FAILED

> Task :src:core:compileJava
Note: Some input files use or override a deprecated API.
Note: Recompile with -Xlint:deprecation for details.
Note: <https://builds.apache.org/job/JMeter-trunk/ws/src/core/src/main/java/org/apache/jmeter/save/converters/TestElementPropertyConverter.java>
uses unchecked or unsafe operations.
Note: Recompile with -Xlint:unchecked for details.

> Task :src:dist:distTarSource
> Task :src:jorphan:checkstyleMain

FAILURE: Build failed with an exception.

* What went wrong:
Execution failed for task ':src:bshclient:spotbugsMain'.
> SpotBugs rule violations were found. See the report at: file://<https://builds.apache.org/job/JMeter-trunk/ws/src/bshclient/build/reports/spotbugs/main.xml>

* Try:
Run with --stacktrace option to get the stack trace. Run with --info or --debug option to
get more log output. Run with --scan to get full insights.

* Get more help at https://help.gradle.org

Deprecated Gradle features were used in this build, making it incompatible with Gradle 6.0.
Use '--warning-mode all' to show the individual deprecation warnings.
See https://docs.gradle.org/5.5.1/userguide/command_line_interface.html#sec:command_line_warnings

BUILD FAILED in 42s
47 actionable tasks: 13 executed, 34 up-to-date
Build step 'Invoke Gradle script' changed build result to FAILURE
Build step 'Invoke Gradle script' marked build as failure
WARN: Found multiple 'report-task.txt' in the workspace. Taking the first one.
<https://builds.apache.org/job/JMeter-trunk/ws/.sonar/report-task.txt>
<https://builds.apache.org/job/JMeter-trunk/ws/build/sonar/report-task.txt>
[locks-and-latches] Releasing all the locks
[locks-and-latches] All the locks released
Archiving artifacts
Recording test results
ERROR: Step ?Publish JUnit test result report? failed: Test reports were found but none of
them are new. Did leafNodes run? 
For example, <https://builds.apache.org/job/JMeter-trunk/ws/src/components/build/test-results/test/TEST-org.apache.jmeter.assertions.DurationAssertionTest.xml>
is 21 hr old


Mime
View raw message