jmeter-dev mailing list archives

Site index · List index
Message view « Date » · « Thread »
Top « Date » · « Thread »
From Apache Jenkins Server <jenk...@builds.apache.org>
Subject Build failed in Jenkins: JMeter Windows #1434
Date Wed, 07 Aug 2019 17:34:35 GMT
See <https://builds.apache.org/job/JMeter%20Windows/1434/display/redirect?page=changes>

Changes:

[felix.schumacher] Describe usage of gradle properties for proxy settings

[pmouawad] java module does not depend on dbcp2 ldap module depends also on

------------------------------------------
[...truncated 102.89 KB...]
    sun.reflect.NativeMethodAccessorImpl#invoke0
    sun.reflect.NativeMethodAccessorImpl#invoke at line:62
    sun.reflect.DelegatingMethodAccessorImpl#invoke at line:43
    java.lang.reflect.Method#invoke at line:498
    org.junit.runners.model.FrameworkMethod$1#runReflectiveCall at line:50
    org.junit.internal.runners.model.ReflectiveCallable#run at line:12
    org.junit.runners.model.FrameworkMethod#invokeExplosively at line:47
    org.junit.internal.runners.statements.InvokeMethod#evaluate at line:17
    org.junit.runners.ParentRunner#runLeaf at line:325
    org.junit.runners.BlockJUnit4ClassRunner#runChild at line:78
    org.junit.runners.BlockJUnit4ClassRunner#runChild at line:57
    org.junit.runners.ParentRunner$3#run at line:290
    org.junit.runners.ParentRunner$1#schedule at line:71
    org.junit.runners.ParentRunner#runChildren at line:288
    org.junit.runners.ParentRunner#access$000 at line:58
    org.junit.runners.ParentRunner$2#evaluate at line:268
    org.junit.runners.ParentRunner#run at line:363
    org.gradle.api.internal.tasks.testing.junit.JUnitTestClassExecutor#runTestClass at line:110
    org.gradle.api.internal.tasks.testing.junit.JUnitTestClassExecutor#execute at line:58
    org.gradle.api.internal.tasks.testing.junit.JUnitTestClassExecutor#execute at line:38
    org.gradle.api.internal.tasks.testing.junit.AbstractJUnitTestClassProcessor#processTestClass
at line:62
    org.gradle.api.internal.tasks.testing.SuiteTestClassProcessor#processTestClass at line:51
    sun.reflect.GeneratedMethodAccessor8#invoke
    sun.reflect.DelegatingMethodAccessorImpl#invoke at line:43
    java.lang.reflect.Method#invoke at line:498
    org.gradle.internal.dispatch.ReflectionDispatch#dispatch at line:35
    org.gradle.internal.dispatch.ReflectionDispatch#dispatch at line:24
    org.gradle.internal.dispatch.ContextClassLoaderDispatch#dispatch at line:32
    org.gradle.internal.dispatch.ProxyDispatchAdapter$DispatchingInvocationHandler#invoke
at line:93
    com.sun.proxy.$Proxy2#processTestClass
    org.gradle.api.internal.tasks.testing.worker.TestWorker#processTestClass at line:118
    sun.reflect.GeneratedMethodAccessor7#invoke
    sun.reflect.DelegatingMethodAccessorImpl#invoke at line:43
    java.lang.reflect.Method#invoke at line:498
    org.gradle.internal.dispatch.ReflectionDispatch#dispatch at line:35
    org.gradle.internal.dispatch.ReflectionDispatch#dispatch at line:24
    org.gradle.internal.remote.internal.hub.MessageHubBackedObjectConnection$DispatchWrapper#dispatch
at line:175
    org.gradle.internal.remote.internal.hub.MessageHubBackedObjectConnection$DispatchWrapper#dispatch
at line:157
    org.gradle.internal.remote.internal.hub.MessageHub$Handler#run at line:404
    org.gradle.internal.concurrent.ExecutorPolicy$CatchAndRecordFailures#onExecute at line:63
    org.gradle.internal.concurrent.ManagedExecutorImpl$1#run at line:46
    java.util.concurrent.ThreadPoolExecutor#runWorker at line:1149
    java.util.concurrent.ThreadPoolExecutor$Worker#run at line:624
    org.gradle.internal.concurrent.ThreadFactoryImpl$ManagedThreadRunnable#run at line:55
    java.lang.Thread#run at line:748

    Thread[main,5,main], stackTrace:sun.misc.Unsafe#park
    java.util.concurrent.locks.LockSupport#park at line:175
    java.util.concurrent.locks.AbstractQueuedSynchronizer#parkAndCheckInterrupt at line:836
    java.util.concurrent.locks.AbstractQueuedSynchronizer#doAcquireSharedInterruptibly at
line:997
    java.util.concurrent.locks.AbstractQueuedSynchronizer#acquireSharedInterruptibly at line:1304
    java.util.concurrent.CountDownLatch#await at line:231
    org.gradle.api.internal.tasks.testing.worker.TestWorker#execute at line:72
    org.gradle.api.internal.tasks.testing.worker.TestWorker#execute at line:46
    org.gradle.process.internal.worker.child.ActionExecutionWorker#execute at line:86
    org.gradle.process.internal.worker.child.ActionExecutionWorker#execute at line:34
    org.gradle.process.internal.worker.child.SystemApplicationClassLoaderWorker#call at line:132
    org.gradle.process.internal.worker.child.SystemApplicationClassLoaderWorker#call at line:68
    worker.org.gradle.process.internal.worker.GradleWorkerMain#run at line:68
    worker.org.gradle.process.internal.worker.GradleWorkerMain#main at line:73

    Thread[/127.0.0.1:63886 to /127.0.0.1:63879 workers Thread 3,5,main], stackTrace:sun.nio.ch.WindowsSelectorImpl$SubSelector#poll0
    sun.nio.ch.WindowsSelectorImpl$SubSelector#poll at line:296
    sun.nio.ch.WindowsSelectorImpl$SubSelector#access$400 at line:278
    sun.nio.ch.WindowsSelectorImpl#doSelect at line:159
    sun.nio.ch.SelectorImpl#lockAndDoSelect at line:86
    sun.nio.ch.SelectorImpl#select at line:97
    sun.nio.ch.SelectorImpl#select at line:101
    org.gradle.internal.remote.internal.inet.SocketConnection$SocketInputStream#read at line:179
    com.esotericsoftware.kryo.io.Input#fill at line:146
    com.esotericsoftware.kryo.io.Input#require at line:178
    com.esotericsoftware.kryo.io.Input#readByte at line:295
    org.gradle.internal.serialize.kryo.KryoBackedDecoder#readByte at line:80
    org.gradle.internal.remote.internal.hub.InterHubMessageSerializer$MessageReader#read at
line:63
    org.gradle.internal.remote.internal.hub.InterHubMessageSerializer$MessageReader#read at
line:52
    org.gradle.internal.remote.internal.inet.SocketConnection#receive at line:80
    org.gradle.internal.remote.internal.hub.MessageHub$ConnectionReceive#run at line:263
    org.gradle.internal.concurrent.ExecutorPolicy$CatchAndRecordFailures#onExecute at line:63
    org.gradle.internal.concurrent.ManagedExecutorImpl$1#run at line:46
    java.util.concurrent.ThreadPoolExecutor#runWorker at line:1149
    java.util.concurrent.ThreadPoolExecutor$Worker#run at line:624
    org.gradle.internal.concurrent.ThreadFactoryImpl$ManagedThreadRunnable#run at line:55
    java.lang.Thread#run at line:748


org.apache.jmeter.testbeans.gui.TestFieldStringEditor > testSetGetAsText STANDARD_OUT
    JMeterUtils.getJMeterVe rsion() = 5.2.0-SNAPSHOT fe74a23
    JMeterUtils.getJMeterVe rsion() = 5.2.0-SNAPSHOT fe74a23
    JMeterUtils.getJMeterVe rsion() = 5.2.0-SNAPSHOT fe74a23

> Task :src:dist:populateLibs
> Task :src:dist:copyBinLibs UP-TO-DATE
> Task :src:functions:compileTestJava UP-TO-DATE
> Task :src:protocol:http:compileTestJava UP-TO-DATE
> Task :src:functions:compileTestGroovy
> Task :src:functions:testClasses
> Task :src:functions:testJar UP-TO-DATE
> Task :src:protocol:http:compileTestGroovy
> Task :src:protocol:http:testClasses
> Task :src:protocol:http:testJar UP-TO-DATE
> Task :src:dist-check:compileTestJava UP-TO-DATE
> Task :src:functions:checkstyleTest
> Task :src:functions:spotbugsTest SKIPPED
> Task :src:protocol:http:checkstyleTest
> Task :src:protocol:http:spotbugsTest SKIPPED
> Task :src:core:check

> Task :src:functions:test

org.apache.jmeter.functions.CSVReadFunctionTest STANDARD_OUT
    Setting JMeterHome: F:\jenkins\jenkins-slave\workspace\JMeter Windows\src\functions\..\..\.
    Initializing Properties: ../.././bin/jmeter.properties

org.apache.jmeter.functions.CSVReadFunctionTest STANDARD_ERROR
    Aug 07, 2019 10:33:23 AM java.util.prefs.WindowsPreferences <init>
    WARNING: Could not open/create prefs root node Software\JavaSoft\Prefs at root 0x80000002.
Windows RegCreateKeyEx(...) returned error code 5.

org.apache.jmeter.functions.CSVReadFunctionTest STANDARD_OUT
    JMeterVersion=5.2.0-SNAPSHOT fe74a23
    java.version=1.8.0_152
    java.vm.name=Java HotSpot(TM) 64-Bit Server VM
    java.vendor=Oracle Corporation
    java.home=F:\jenkins\tools\java\latest1.8\jre
    file.encoding=windows-1252
    default encoding=windows-1252
    user.home=C:\Users\jenkins
    user.dir=F:\jenkins\jenkins-slave\workspace\JMeter Windows\src\functions
    user.language=en
    user.region=null
    user.country=US
    user.variant=
    Locale=en_US
    java.class.version=52.0
    java.awt.headless=
    os.name=Windows Server 2016
    os.version=10.0
    os.arch=amd64

> Task :src:dist-check:compileTestGroovy
> Task :src:dist-check:testClasses

> Task :src:protocol:http:test

org.apache.jmeter.gui.action.ParseCurlCommandActionTest > testCreateCookieManager STANDARD_ERROR
    Aug 07, 2019 10:33:24 AM java.util.prefs.WindowsPreferences <init>
    WARNING: Could not open/create prefs root node Software\JavaSoft\Prefs at root 0x80000002.
Windows RegCreateKeyEx(...) returned error code 5.

org.apache.jmeter.protocol.http.config.UrlConfigTest STANDARD_OUT
    Setting JMeterHome: F:\jenkins\jenkins-slave\workspace\JMeter Windows\src\protocol\http\..\..\..\.
    Initializing Properties: ../../.././bin/jmeter.properties
    JMeterVersion=5.2.0-SNAPSHOT fe74a23
    java.version=1.8.0_152
    java.vm.name=Java HotSpot(TM) 64-Bit Server VM
    java.vendor=Oracle Corporation
    java.home=F:\jenkins\tools\java\latest1.8\jre
    file.encoding=windows-1252
    default encoding=windows-1252
    user.home=C:\Users\jenkins
    user.dir=F:\jenkins\jenkins-slave\workspace\JMeter Windows\src\protocol\http
    user.language=en
    user.region=null
    user.country=US
    user.variant=
    Locale=en_US
    java.class.version=52.0
    java.awt.headless=
    os.name=Windows Server 2016
    os.version=10.0
    os.arch=amd64

> Task :src:dist-check:checkstyleTest
> Task :src:dist-check:spotbugsTest SKIPPED
> Task :src:functions:check
> Task :src:dist:copyLibs
> Task :src:dist:compileTestJava NO-SOURCE
> Task :src:dist:testClasses UP-TO-DATE
> Task :src:dist:checkstyleTest NO-SOURCE
> Task :src:dist:spotbugsTest SKIPPED
> Task :src:dist:test NO-SOURCE
> Task :src:dist:check UP-TO-DATE
> Task :src:dist:createDist
> Task :src:dist-check:copyExtraTestLibs UP-TO-DATE

> Task :src:dist-check:batchBUG_62847
Aug 07, 2019 10:33:41 AM java.util.prefs.WindowsPreferences <init>
WARNING: Could not open/create prefs root node Software\JavaSoft\Prefs at root 0x80000002.
Windows RegCreateKeyEx(...) returned error code 5.
Creating summariser <summary>
Created the tree successfully using F:\jenkins\jenkins-slave\workspace\JMeter Windows\bin\testfiles\BUG_62847.jmx
Starting the test @ Wed Aug 07 10:33:41 PDT 2019 (1565199221140)
Waiting for possible Shutdown/StopTestNow/HeapDump/ThreadDump message on port 4445
summary =      6 in 00:00:00 =   13.4/s Avg:     0 Min:     0 Max:     1 Err:     0 (0.00%)
Tidying up ...    @ Wed Aug 07 10:33:41 PDT 2019 (1565199221837)
... end of run
No errors present in the logfile F:\jenkins\jenkins-slave\workspace\JMeter Windows\bin\BUG_62847.log
(the file is empty)

> Task :src:dist-check:batchBatchTestLocal
Aug 07, 2019 10:33:44 AM java.util.prefs.WindowsPreferences <init>
WARNING: Could not open/create prefs root node Software\JavaSoft\Prefs at root 0x80000002.
Windows RegCreateKeyEx(...) returned error code 5.
Creating summariser <summary>
Created the tree successfully using F:\jenkins\jenkins-slave\workspace\JMeter Windows\bin\testfiles\BatchTestLocal.jmx
Starting the test @ Wed Aug 07 10:33:44 PDT 2019 (1565199224428)
Waiting for possible Shutdown/StopTestNow/HeapDump/ThreadDump message on port 4445

> Task :src:protocol:http:test

org.apache.jmeter.protocol.http.sampler.SamplingNamingTest > testBug63364[Run 0: implementation:HttpClient4]
FAILED
    java.lang.AssertionError: We should have at least one sample result, we had none
        at org.junit.Assert.fail(Assert.java:88)
        at org.junit.Assert.assertTrue(Assert.java:41)
        at org.apache.jmeter.protocol.http.sampler.SamplingNamingTest.testBug63364(SamplingNamingTest.java:55)

org.apache.jmeter.protocol.http.sampler.SamplingNamingTest > testBug63364[Run 1: implementation:Java]
FAILED
    java.lang.AssertionError: We should have at least one sample result, we had none
        at org.junit.Assert.fail(Assert.java:88)
        at org.junit.Assert.assertTrue(Assert.java:41)
        at org.apache.jmeter.protocol.http.sampler.SamplingNamingTest.testBug63364(SamplingNamingTest.java:55)

596 tests completed, 2 failed

> Task :src:protocol:http:test FAILED

> Task :src:dist-check:batchBatchTestLocal
summary +     92 in 00:00:45 =    2.0/s Avg:   128 Min:     2 Max:   254 Err:    12 (13.04%)
Active: 1 Started: 2 Finished: 1
summary +     41 in 00:00:04 =    9.7/s Avg:    99 Min:     1 Max:   229 Err:     4 (9.76%)
Active: 0 Started: 1 Finished: 1
summary =    133 in 00:00:50 =    2.7/s Avg:   119 Min:     1 Max:   254 Err:    16 (12.03%)
Tidying up ...    @ Wed Aug 07 10:34:34 PDT 2019 (1565199274460)
... end of run
No errors present in the logfile F:\jenkins\jenkins-slave\workspace\JMeter Windows\bin\BatchTestLocal.log
(the file is empty)

FAILURE: Build failed with an exception.

* What went wrong:
Execution failed for task ':src:protocol:http:test'.
> There were failing tests. See the report at: file:///F:/jenkins/jenkins-slave/workspace/JMeter%20Windows/src/protocol/http/build/reports/tests/test/index.html

* Try:
Run with --stacktrace option to get the stack trace. Run with --info or --debug option to
get more log output. Run with --scan to get full insights.

* Get more help at https://help.gradle.org

Deprecated Gradle features were used in this build, making it incompatible with Gradle 6.0.
Use '--warning-mode all' to show the individual deprecation warnings.
See https://docs.gradle.org/5.5.1/userguide/command_line_interface.html#sec:command_line_warnings

BUILD FAILED in 3m 50s
156 actionable tasks: 66 executed, 90 up-to-date
Could not open/create prefs root node Software\JavaSoft\Prefs at root 0x80000002. Windows
RegCreateKeyEx(...) returned error code 5.
Build step 'Invoke Gradle script' changed build result to FAILURE
Build step 'Invoke Gradle script' marked build as failure

Mime
View raw message