jmeter-dev mailing list archives

Site index · List index
Message view « Date » · « Thread »
Top « Date » · « Thread »
From Apache Jenkins Server <jenk...@builds.apache.org>
Subject Build failed in Jenkins: JMeter-trunk #7288
Date Sat, 03 Aug 2019 19:53:23 GMT
See <https://builds.apache.org/job/JMeter-trunk/7288/display/redirect?page=changes>

Changes:

[sitnikov.vladimir] Increase timeouts for DNSCacheManagerSpec: 100 -> 5000

[sitnikov.vladimir] Add SpotBugs results to Sonarqube report

------------------------------------------
[...truncated 105.89 KB...]
    Setting JMeterHome: <https://builds.apache.org/job/JMeter-trunk/ws/src/core/../../.>
    Initializing Properties: ../.././bin/jmeter.properties
    JMeterVersion=5.2.0-SNAPSHOT 80ac903
    java.version=1.8.0_191
    java.vm.name=Java HotSpot(TM) 64-Bit Server VM
    java.vendor=Oracle Corporation
    java.home=/usr/local/asfpackages/java/jdk1.8.0_191/jre
    file.encoding=ISO-8859-1
    default encoding=ISO-8859-1
    user.home=/home/jenkins
    user.dir=<https://builds.apache.org/job/JMeter-trunk/ws/src/core>
    user.language=en
    user.region=null
    user.country=US
    user.variant=
    Locale=en_US
    java.class.version=52.0
    java.awt.headless=true
    os.name=Linux
    os.version=4.4.0-143-generic
    os.arch=amd64

org.apache.jmeter.samplers.TestSampleResult > testSubResultsFalsePause FAILED
    java.lang.AssertionError: TestElapsed: 419 -  ParentElapsed: 401 => 18 not in [0,16];
nanotime=false
        at org.junit.Assert.fail(Assert.java:88)
        at org.apache.jmeter.samplers.TestSampleResult.testSubResults(TestSampleResult.java:292)
        at org.apache.jmeter.samplers.TestSampleResult.testSubResults(TestSampleResult.java:198)
        at org.apache.jmeter.samplers.TestSampleResult.testSubResultsFalsePause(TestSampleResult.java:181)

> Task :src:components:check
> Task :src:components:jar
> Task :src:dist-check:spotbugsMain NO-SOURCE
> Task :src:components:testJar
> Task :src:components:assemble

> Task :src:core:test

org.apache.jmeter.resources.PackageTest > checkI18n STANDARD_OUT
    Ignoring missing junit_failure_default_code=0001 in org/apache/jmeter/resources/messages_fr.properties
    Ignoring missing aggregate_report_90=90% in org/apache/jmeter/resources/messages_fr.properties
    Ignoring missing junit_error_default_code=9999 in org/apache/jmeter/resources/messages_fr.properties
    Ignoring missing junit_success_default_code=1000 in org/apache/jmeter/resources/messages_fr.properties

> Task :src:licenses:gatherBinaryLicenses
> Task :src:licenses:renderLicenseForBinary

> Task :src:core:test

org.apache.jmeter.JMeterTest > testSuccessWhenJmxExists STANDARD_OUT
    Creating summariser <summary>
    Created the tree successfully using /tmp/testPlan1498434522785560230.jmx
    Starting the test @ Sat Aug 03 19:52:34 UTC 2019 (1564861954280)
    Waiting for possible Shutdown/StopTestNow/HeapDump/ThreadDump message on port 4445

org.apache.jmeter.JMeterTest > testFailureWithMissingPlugin STANDARD_OUT
    Error in NonGUIDriver java.lang.IllegalArgumentException: Problem loading XML from:'/tmp/testPlan767498065525478040.jmx'.

    Cause:
    CannotResolveClassException: kg.apc.jmeter.samplers.DummySampler

     Detail:com.thoughtworks.xstream.converters.ConversionException: 
    ---- Debugging information ----
    cause-exception     : com.thoughtworks.xstream.converters.ConversionException
    cause-message       : 
    first-jmeter-class  : org.apache.jmeter.save.converters.HashTreeConverter.unmarshal(HashTreeConverter.java:67)
    class               : org.apache.jmeter.save.ScriptWrapper
    required-type       : org.apache.jmeter.save.ScriptWrapper
    converter-type      : org.apache.jmeter.save.ScriptWrapperConverter
    path                : /jmeterTestPlan/hashTree/hashTree/hashTree/kg.apc.jmeter.samplers.DummySampler
    line number         : 16
    version             : not available
    -------------------------------

org.apache.jmeter.testbeans.gui.TestFieldStringEditor > testSetGetAsText STANDARD_OUT
    summary =      0 in 00:00:00 = ******/s Avg:     0 Min: 9223372036854775807 Max: -9223372036854775808
Err:     0 (0.00%)
    Tidying up ...    @ Sat Aug 03 19:52:34 UTC 2019 (1564861954710)
    ... end of run
    JMeterUtils.getJMeterVe rsion() = 5.2.0-SNAPSHOT 80ac903
    JMeterUtils.getJMeterVe rsion() = 5.2.0-SNAPSHOT 80ac903
    JMeterUtils.getJMeterVe rsion() = 5.2.0-SNAPSHOT 80ac903

org.apache.jmeter.engine.LocalHostTest > testLocalHost STANDARD_ERROR
    java.rmi.server.hostname=null
    asf929.gq1.ygridcore.net/67.195.81.179
    isSiteLocalAddress:false
    isAnyLocalAddress:false
    isLinkLocalAddress:false
    isLoopbackAddress:false
    isMulticastAddress:false
    localhost/127.0.0.1
    isSiteLocalAddress:false
    isAnyLocalAddress:false
    isLinkLocalAddress:false
    isLoopbackAddress:true
    isMulticastAddress:false
    ====================
    asf929.gq1.ygridcore.net/67.195.81.179
    isSiteLocalAddress:false
    isAnyLocalAddress:false
    isLinkLocalAddress:false
    isLoopbackAddress:false
    isMulticastAddress:false

org.apache.jmeter.engine.LocalHostTest > testInterfaces STANDARD_ERROR
    Interfaces: {name:docker0 (docker0) => [/fe80:0:0:0:42:93ff:fe78:f66d%docker0/64 [null],
/172.17.0.1/16 [/0.0.0.0]], name:enp5s0f0 (enp5s0f0) => [/fe80:0:0:0:28c:faff:fe5b:40f4%enp5s0f0/64
[null], /67.195.81.179/26 [/67.195.81.191]], name:lo (lo) => [/0:0:0:0:0:0:0:1%lo/128 [null],
/127.0.0.1/8 [null]]}
    Choose 172.17.0.1 to talk to external services
    java.rmi.server.hostname=null

org.apache.jmeter.report.processor.FieldSampleComparatorSpec STANDARD_OUT
    The JVM should have exited but did not.
    The following non-daemon threads are still running (DestroyJavaVM is OK):
    Thread[main,5,main], stackTrace:sun.misc.Unsafe#park
    java.util.concurrent.locks.LockSupport#park at line:175
    java.util.concurrent.locks.AbstractQueuedSynchronizer#parkAndCheckInterrupt at line:836
    java.util.concurrent.locks.AbstractQueuedSynchronizer#doAcquireSharedInterruptibly at
line:997
    java.util.concurrent.locks.AbstractQueuedSynchronizer#acquireSharedInterruptibly at line:1304
    java.util.concurrent.CountDownLatch#await at line:231
    org.gradle.api.internal.tasks.testing.worker.TestWorker#execute at line:72
    org.gradle.api.internal.tasks.testing.worker.TestWorker#execute at line:46
    org.gradle.process.internal.worker.child.ActionExecutionWorker#execute at line:86
    org.gradle.process.internal.worker.child.ActionExecutionWorker#execute at line:34
    org.gradle.process.internal.worker.child.SystemApplicationClassLoaderWorker#call at line:132
    org.gradle.process.internal.worker.child.SystemApplicationClassLoaderWorker#call at line:68
    worker.org.gradle.process.internal.worker.GradleWorkerMain#run at line:68
    worker.org.gradle.process.internal.worker.GradleWorkerMain#main at line:73

    Thread[/0:0:0:0:0:0:0:1:46870 to /0:0:0:0:0:0:0:1:42785 workers Thread 3,5,main], stackTrace:sun.nio.ch.EPollArrayWrapper#epollWait
    sun.nio.ch.EPollArrayWrapper#poll at line:269
    sun.nio.ch.EPollSelectorImpl#doSelect at line:93
    sun.nio.ch.SelectorImpl#lockAndDoSelect at line:86
    sun.nio.ch.SelectorImpl#select at line:97
    sun.nio.ch.SelectorImpl#select at line:101
    org.gradle.internal.remote.internal.inet.SocketConnection$SocketInputStream#read at line:179
    com.esotericsoftware.kryo.io.Input#fill at line:146
    com.esotericsoftware.kryo.io.Input#require at line:178
    com.esotericsoftware.kryo.io.Input#readByte at line:295
    org.gradle.internal.serialize.kryo.KryoBackedDecoder#readByte at line:80
    org.gradle.internal.remote.internal.hub.InterHubMessageSerializer$MessageReader#read at
line:63
    org.gradle.internal.remote.internal.hub.InterHubMessageSerializer$MessageReader#read at
line:52
    org.gradle.internal.remote.internal.inet.SocketConnection#receive at line:80
    org.gradle.internal.remote.internal.hub.MessageHub$ConnectionReceive#run at line:263
    org.gradle.internal.concurrent.ExecutorPolicy$CatchAndRecordFailures#onExecute at line:63
    org.gradle.internal.concurrent.ManagedExecutorImpl$1#run at line:46
    java.util.concurrent.ThreadPoolExecutor#runWorker at line:1149
    java.util.concurrent.ThreadPoolExecutor$Worker#run at line:624
    org.gradle.internal.concurrent.ThreadFactoryImpl$ManagedThreadRunnable#run at line:55
    java.lang.Thread#run at line:748

    Thread[/0:0:0:0:0:0:0:1:46870 to /0:0:0:0:0:0:0:1:42785 workers Thread 2,5,main], stackTrace:sun.misc.Unsafe#park
    java.util.concurrent.locks.LockSupport#park at line:175
    java.util.concurrent.locks.AbstractQueuedSynchronizer$ConditionObject#await at line:2039
    org.gradle.internal.remote.internal.hub.queue.EndPointQueue#take at line:48
    org.gradle.internal.remote.internal.hub.MessageHub$ConnectionDispatch#run at line:314
    org.gradle.internal.concurrent.ExecutorPolicy$CatchAndRecordFailures#onExecute at line:63
    org.gradle.internal.concurrent.ManagedExecutorImpl$1#run at line:46
    java.util.concurrent.ThreadPoolExecutor#runWorker at line:1149
    java.util.concurrent.ThreadPoolExecutor$Worker#run at line:624
    org.gradle.internal.concurrent.ThreadFactoryImpl$ManagedThreadRunnable#run at line:55
    java.lang.Thread#run at line:748

    Thread[Test worker,5,main], stackTrace:org.jacoco.agent.rt.internal_28bab1d.asm.ClassReader#readCode
at line:1603
    org.jacoco.agent.rt.internal_28bab1d.asm.ClassReader#readMethod at line:1275
    org.jacoco.agent.rt.internal_28bab1d.asm.ClassReader#accept at line:679
    org.jacoco.agent.rt.internal_28bab1d.asm.ClassReader#accept at line:391
    org.jacoco.agent.rt.internal_28bab1d.core.instr.Instrumenter#instrument at line:103
    org.jacoco.agent.rt.internal_28bab1d.core.instr.Instrumenter#instrument at line:123
    org.jacoco.agent.rt.internal_28bab1d.CoverageTransformer#transform at line:91
    sun.instrument.TransformerManager#transform at line:188
    sun.instrument.InstrumentationImpl#transform at line:428
    java.lang.ClassLoader#defineClass1
    java.lang.ClassLoader#defineClass at line:763
    java.security.SecureClassLoader#defineClass at line:142
    java.net.URLClassLoader#defineClass at line:468
    java.net.URLClassLoader#access$100 at line:74
    java.net.URLClassLoader$1#run at line:369
    java.net.URLClassLoader$1#run at line:363
    java.security.AccessController#doPrivileged
    java.net.URLClassLoader#findClass at line:362
    java.lang.ClassLoader#loadClass at line:424
    sun.misc.Launcher$AppClassLoader#loadClass at line:349
    java.lang.ClassLoader#loadClass at line:357
    java.lang.Class#forName0
    java.lang.Class#forName at line:348
    org.gradle.api.internal.tasks.testing.junit.JUnitTestClassExecutor#runTestClass at line:67
    org.gradle.api.internal.tasks.testing.junit.JUnitTestClassExecutor#execute at line:58
    org.gradle.api.internal.tasks.testing.junit.JUnitTestClassExecutor#execute at line:38
    org.gradle.api.internal.tasks.testing.junit.AbstractJUnitTestClassProcessor#processTestClass
at line:62
    org.gradle.api.internal.tasks.testing.SuiteTestClassProcessor#processTestClass at line:51
    sun.reflect.GeneratedMethodAccessor6#invoke
    sun.reflect.DelegatingMethodAccessorImpl#invoke at line:43
    java.lang.reflect.Method#invoke at line:498
    org.gradle.internal.dispatch.ReflectionDispatch#dispatch at line:35
    org.gradle.internal.dispatch.ReflectionDispatch#dispatch at line:24
    org.gradle.internal.dispatch.ContextClassLoaderDispatch#dispatch at line:32
    org.gradle.internal.dispatch.ProxyDispatchAdapter$DispatchingInvocationHandler#invoke
at line:93
    com.sun.proxy.$Proxy2#processTestClass
    org.gradle.api.internal.tasks.testing.worker.TestWorker#processTestClass at line:118
    sun.reflect.GeneratedMethodAccessor5#invoke
    sun.reflect.DelegatingMethodAccessorImpl#invoke at line:43
    java.lang.reflect.Method#invoke at line:498
    org.gradle.internal.dispatch.ReflectionDispatch#dispatch at line:35
    org.gradle.internal.dispatch.ReflectionDispatch#dispatch at line:24
    org.gradle.internal.remote.internal.hub.MessageHubBackedObjectConnection$DispatchWrapper#dispatch
at line:175
    org.gradle.internal.remote.internal.hub.MessageHubBackedObjectConnection$DispatchWrapper#dispatch
at line:157
    org.gradle.internal.remote.internal.hub.MessageHub$Handler#run at line:404
    org.gradle.internal.concurrent.ExecutorPolicy$CatchAndRecordFailures#onExecute at line:63
    org.gradle.internal.concurrent.ManagedExecutorImpl$1#run at line:46
    java.util.concurrent.ThreadPoolExecutor#runWorker at line:1149
    java.util.concurrent.ThreadPoolExecutor$Worker#run at line:624
    org.gradle.internal.concurrent.ThreadFactoryImpl$ManagedThreadRunnable#run at line:55
    java.lang.Thread#run at line:748


250 tests completed, 1 failed

> Task :src:core:test FAILED
> Task :src:examples:spotbugsMain
> Task :src:generator:spotbugsMain

> Task :src:functions:spotbugsMain
SpotBugs rule violations were found. See the report at: file://<https://builds.apache.org/job/JMeter-trunk/ws/src/functions/build/reports/spotbugs/main.xml>

> Task :src:protocol:http:spotbugsMain
SpotBugs rule violations were found. See the report at: file://<https://builds.apache.org/job/JMeter-trunk/ws/src/protocol/http/build/reports/spotbugs/main.xml>
Checksum computation time: 1497, files processed: 179, bytes processed: 110450314

FAILURE: Build failed with an exception.

* What went wrong:
Execution failed for task ':src:core:test'.
> There were failing tests. See the report at: file://<https://builds.apache.org/job/JMeter-trunk/ws/src/core/build/reports/tests/test/index.html>

* Try:
Run with --stacktrace option to get the stack trace. Run with --info or --debug option to
get more log output. Run with --scan to get full insights.

* Get more help at https://help.gradle.org

Deprecated Gradle features were used in this build, making it incompatible with Gradle 6.0.
Use '--warning-mode all' to show the individual deprecation warnings.
See https://docs.gradle.org/5.5.1/userguide/command_line_interface.html#sec:command_line_warnings

BUILD FAILED in 5m 35s
190 actionable tasks: 190 executed
Build step 'Invoke Gradle script' changed build result to FAILURE
Build step 'Invoke Gradle script' marked build as failure
[locks-and-latches] Releasing all the locks
[locks-and-latches] All the locks released
Archiving artifacts
[Fast Archiver] Compressed 38.26 MB of artifacts by 43.3% relative to #7287
Recording test results

Mime
View raw message