jmeter-dev mailing list archives

Site index · List index
Message view « Date » · « Thread »
Top « Date » · « Thread »
From Apache Jenkins Server <jenk...@builds.apache.org>
Subject Build failed in Jenkins: JMeter Windows #1426
Date Sat, 03 Aug 2019 12:04:17 GMT
See <https://builds.apache.org/job/JMeter%20Windows/1426/display/redirect?page=changes>

Changes:

[felix.schumacher] Markup changes.

[felix.schumacher] Use correct project name

[felix.schumacher] Markup and one missing gradle conversion

[felix.schumacher] Markup changes, small fixes and ant to gradle

[felix.schumacher] Use https in docs wherever possible

[sitnikov.vladimir] Dislpay stdout for test execution

[sitnikov.vladimir] Add org.gradle:gradle-wrapper to source LICENSE file

------------------------------------------
[...truncated 80.78 KB...]
    jenkins-win-he-de-5/176.9.73.62
    isSiteLocalAddress:false
    isAnyLocalAddress:false
    isLinkLocalAddress:false
    isLoopbackAddress:false
    isMulticastAddress:false
    ====================
    jenkins-win-he-de-5/fe80:0:0:0:2d89:232e:d1d:fb60%2
    isSiteLocalAddress:false
    isAnyLocalAddress:false
    isLinkLocalAddress:true
    isLoopbackAddress:false
    isMulticastAddress:false

org.apache.jmeter.engine.LocalHostTest > testInterfaces STANDARD_ERROR
    Interfaces: {name:lo (Software Loopback Interface 1) => [/127.0.0.1/8 [/127.255.255.255],
/0:0:0:0:0:0:0:1/128 [null]], name:eth0 (Realtek PCIe GBE Family Controller) => [/176.9.73.62/27
[/176.9.73.63], /fe80:0:0:0:2d89:232e:d1d:fb60%eth0/64 [null]], name:net0 (Teredo Tunneling
Pseudo-Interface) => [/fe80:0:0:0:0:ffff:ffff:fffe%net0/0 [null]], name:eth1 (Microsoft
Kernel Debug Network Adapter) => [], name:net1 (Microsoft ISATAP Adapter #3) => [/fe80:0:0:0:200:5efe:b009:493e%net1/128
[null]], name:eth2 (Realtek PCIe GBE Family Controller-WFP Native MAC Layer LightWeight Filter-0000)
=> [], name:eth3 (Realtek PCIe GBE Family Controller-QoS Packet Scheduler-0000) => [],
name:eth4 (Realtek PCIe GBE Family Controller-WFP 802.3 MAC Layer LightWeight Filter-0000)
=> []}
    Choose 176.9.73.62 to talk to external services
    java.rmi.server.hostname=null

> Task :src:protocol:jdbc:check

> Task :src:protocol:ldap:test

org.apache.jmeter.protocol.ldap.config.gui.PackageTest > testLDAPArgumentCreation STANDARD_ERROR
    Aug 03, 2019 5:03:50 AM java.util.prefs.WindowsPreferences <init>
    WARNING: Could not open/create prefs root node Software\JavaSoft\Prefs at root 0x80000002.
Windows RegCreateKeyEx(...) returned error code 5.

> Task :src:components:compileGroovy NO-SOURCE
> Task :src:components:classes

> Task :src:protocol:mail:test

org.apache.jmeter.protocol.mail.sampler.TestMailReaderSampler > testPassCustomProperties
STANDARD_ERROR
    Aug 03, 2019 5:03:51 AM java.util.prefs.WindowsPreferences <init>
    WARNING: Could not open/create prefs root node Software\JavaSoft\Prefs at root 0x80000002.
Windows RegCreateKeyEx(...) returned error code 5.

> Task :src:protocol:ldap:check
> Task :src:protocol:mail:check

> Task :src:protocol:tcp:test

org.apache.jmeter.protocol.tcp.sampler.BinaryTCPClientImplTest > testLoopBack STANDARD_ERROR
    Aug 03, 2019 5:03:52 AM java.util.prefs.WindowsPreferences <init>
    WARNING: Could not open/create prefs root node Software\JavaSoft\Prefs at root 0x80000002.
Windows RegCreateKeyEx(...) returned error code 5.

> Task :src:generator:compileJava
> Task :src:generator:classes
> Task :src:protocol:tcp:check
> Task :src:generator:jar

> Task :src:core:test

org.apache.jmeter.JMeterTest > testSuccessWhenJmxExists FAILED
    org.apache.jorphan.util.JMeterError: JMeter requires the checksum of saveservice properties
file to continue
        at org.apache.jmeter.save.SaveService.initProps(SaveService.java:223)
        at org.apache.jmeter.save.SaveService.<clinit>(SaveService.java:165)
        at org.apache.jmeter.JMeter.runNonGui(JMeter.java:1005)
        at org.apache.jmeter.JMeterTest.testSuccessWhenJmxExists(JMeterTest.java:70)

        Caused by:
        java.nio.file.NoSuchFileException: saveservice.properties
            at sun.nio.fs.WindowsException.translateToIOException(WindowsException.java:79)
            at sun.nio.fs.WindowsException.rethrowAsIOException(WindowsException.java:97)
            at sun.nio.fs.WindowsException.rethrowAsIOException(WindowsException.java:102)
            at sun.nio.fs.WindowsFileSystemProvider.newByteChannel(WindowsFileSystemProvider.java:230)
            at java.nio.file.Files.newByteChannel(Files.java:361)
            at java.nio.file.Files.newByteChannel(Files.java:407)
            at java.nio.file.spi.FileSystemProvider.newInputStream(FileSystemProvider.java:384)
            at java.nio.file.Files.newInputStream(Files.java:152)
            at java.nio.file.Files.newBufferedReader(Files.java:2784)
            at org.apache.jmeter.save.SaveService.getChecksumForPropertiesFile(SaveService.java:209)
            at org.apache.jmeter.save.SaveService.initProps(SaveService.java:220)
            ... 3 more

org.apache.jmeter.JMeterTest > testFailureWithMissingPlugin FAILED
    java.lang.NoClassDefFoundError: Could not initialize class org.apache.jmeter.save.SaveService
        at org.apache.jmeter.JMeter.runNonGui(JMeter.java:1005)
        at org.apache.jmeter.JMeterTest.testFailureWithMissingPlugin(JMeterTest.java:112)

org.apache.jmeter.report.core.CsvSampleReaderTest > testReadSample FAILED
    java.lang.NoClassDefFoundError: Could not initialize class org.apache.jmeter.save.SaveService
        at org.apache.jmeter.report.core.AbstractSampleWriter.<clinit>(AbstractSampleWriter.java:52)
        at org.apache.jmeter.report.core.CsvSampleReaderTest.setUp(CsvSampleReaderTest.java:42)

org.apache.jmeter.report.core.CsvSampleReaderTest > testClose FAILED
    java.lang.NoClassDefFoundError: Could not initialize class org.apache.jmeter.report.core.CsvSampleWriter
        at org.apache.jmeter.report.core.CsvSampleReaderTest.setUp(CsvSampleReaderTest.java:42)

org.apache.jmeter.report.core.CsvSampleReaderTest > testPeek FAILED
    java.lang.NoClassDefFoundError: Could not initialize class org.apache.jmeter.report.core.CsvSampleWriter
        at org.apache.jmeter.report.core.CsvSampleReaderTest.setUp(CsvSampleReaderTest.java:42)

org.apache.jmeter.report.core.CsvSampleReaderTest > testConstructorWithInvalidFile FAILED
    java.lang.NoClassDefFoundError: Could not initialize class org.apache.jmeter.report.core.CsvSampleWriter
        at org.apache.jmeter.report.core.CsvSampleReaderTest.setUp(CsvSampleReaderTest.java:42)

org.apache.jmeter.report.core.CsvSampleReaderTest > testGetMetadata FAILED
    java.lang.NoClassDefFoundError: Could not initialize class org.apache.jmeter.report.core.CsvSampleWriter
        at org.apache.jmeter.report.core.CsvSampleReaderTest.setUp(CsvSampleReaderTest.java:42)

org.apache.jmeter.report.core.CsvSampleReaderTest > testHasNextAndReadSample FAILED
    java.lang.NoClassDefFoundError: Could not initialize class org.apache.jmeter.report.core.CsvSampleWriter
        at org.apache.jmeter.report.core.CsvSampleReaderTest.setUp(CsvSampleReaderTest.java:42)

org.apache.jmeter.report.core.TestCsvSampleWriter > testWriteWithoutWriter FAILED
    java.lang.RuntimeException: Could not read JMeter properties file:null/jmeter.properties
        at org.apache.jmeter.util.JMeterUtils.loadJMeterProperties(JMeterUtils.java:211)
        at org.apache.jmeter.report.core.TestCsvSampleWriter.setUp(TestCsvSampleWriter.java:39)

org.apache.jmeter.report.core.TestCsvSampleWriter > testCsvSampleWriterConstructorWithWriter
FAILED
    java.lang.RuntimeException: Could not read JMeter properties file:null/jmeter.properties
        at org.apache.jmeter.util.JMeterUtils.loadJMeterProperties(JMeterUtils.java:211)
        at org.apache.jmeter.report.core.TestCsvSampleWriter.setUp(TestCsvSampleWriter.java:39)

org.apache.jmeter.report.core.TestCsvSampleWriter > testWrite FAILED
    java.lang.RuntimeException: Could not read JMeter properties file:null/jmeter.properties
        at org.apache.jmeter.util.JMeterUtils.loadJMeterProperties(JMeterUtils.java:211)
        at org.apache.jmeter.report.core.TestCsvSampleWriter.setUp(TestCsvSampleWriter.java:39)

org.apache.jmeter.report.core.TestCsvSampleWriter > testCsvSampleWriterConstructorWithNull
FAILED
    java.lang.RuntimeException: Could not read JMeter properties file:null/jmeter.properties
        at org.apache.jmeter.util.JMeterUtils.loadJMeterProperties(JMeterUtils.java:211)
        at org.apache.jmeter.report.core.TestCsvSampleWriter.setUp(TestCsvSampleWriter.java:39)

org.apache.jmeter.report.core.TestCsvSampleWriter > testWriteWithoutSample FAILED
    java.lang.RuntimeException: Could not read JMeter properties file:null/jmeter.properties
        at org.apache.jmeter.util.JMeterUtils.loadJMeterProperties(JMeterUtils.java:211)
        at org.apache.jmeter.report.core.TestCsvSampleWriter.setUp(TestCsvSampleWriter.java:39)

org.apache.jmeter.resources.PackageTest > checkI18n STANDARD_OUT
    Ignoring missing junit_failure_default_code=0001 in org/apache/jmeter/resources/messages_fr.properties
    Ignoring missing aggregate_report_90=90% in org/apache/jmeter/resources/messages_fr.properties
    Ignoring missing junit_error_default_code=9999 in org/apache/jmeter/resources/messages_fr.properties
    Ignoring missing junit_success_default_code=1000 in org/apache/jmeter/resources/messages_fr.properties

> Task :src:components:checkstyleMain
> Task :src:generator:checkstyleMain
> Task :src:generator:compileTestJava NO-SOURCE
> Task :src:generator:testClasses UP-TO-DATE
> Task :src:generator:checkstyleTest NO-SOURCE
> Task :src:examples:compileJava
> Task :src:examples:classes
> Task :src:examples:checkstyleMain
> Task :src:examples:compileTestJava NO-SOURCE
> Task :src:examples:testClasses UP-TO-DATE
> Task :src:examples:checkstyleTest NO-SOURCE

> Task :src:functions:compileJava
Note: F:\jenkins\jenkins-slave\workspace\JMeter Windows\src\functions\src\main\java\org\apache\jmeter\functions\StringFromFile.java
uses or overrides a deprecated API.
Note: Recompile with -Xlint:deprecation for details.

> Task :src:components:compileTestJava
> Task :src:functions:compileGroovy NO-SOURCE
> Task :src:functions:classes
> Task :src:functions:jar

> Task :src:core:test

org.apache.jmeter.testbeans.gui.TestFieldStringEditor > testSetGetAsText STANDARD_OUT
    JMeterUtils.getJMeterVe rsion() = 5.2.0-SNAPSHOT 7becdca
    JMeterUtils.getJMeterVe rsion() = 5.2.0-SNAPSHOT 7becdca
    JMeterUtils.getJMeterVe rsion() = 5.2.0-SNAPSHOT 7becdca

> Task :src:functions:checkstyleMain
> Task :src:components:compileTestGroovy
> Task :src:components:testClasses
> Task :src:components:checkstyleTest
> Task :src:components:spotbugsMain SKIPPED
> Task :src:components:spotbugsTest SKIPPED

> Task :src:protocol:http:compileJava
Note: Some input files use or override a deprecated API.
Note: Recompile with -Xlint:deprecation for details.
Note: F:\jenkins\jenkins-slave\workspace\JMeter Windows\src\protocol\http\src\main\java\org\apache\jmeter\protocol\http\sampler\HTTPHC4Impl.java
uses unchecked or unsafe operations.
Note: Recompile with -Xlint:unchecked for details.

> Task :src:protocol:http:compileGroovy NO-SOURCE
> Task :src:protocol:http:classes
> Task :src:dist:compileJava NO-SOURCE
> Task :src:dist:classes UP-TO-DATE
> Task :src:dist-check:compileJava NO-SOURCE
> Task :src:dist:checkstyleMain NO-SOURCE
> Task :src:dist-check:compileGroovy NO-SOURCE
> Task :src:dist-check:classes UP-TO-DATE
> Task :src:dist-check:checkstyleMain NO-SOURCE
> Task :src:dist:jar

> Task :src:components:test

org.apache.jmeter.assertions.DurationAssertionTest STANDARD_OUT
    Setting JMeterHome: F:\jenkins\jenkins-slave\workspace\JMeter Windows\src\components\..\..\.
    Initializing Properties: ../.././bin/jmeter.properties

org.apache.jmeter.assertions.DurationAssertionTest STANDARD_ERROR
    Aug 03, 2019 5:04:02 AM java.util.prefs.WindowsPreferences <init>
    WARNING: Could not open/create prefs root node Software\JavaSoft\Prefs at root 0x80000002.
Windows RegCreateKeyEx(...) returned error code 5.

org.apache.jmeter.assertions.DurationAssertionTest STANDARD_OUT
    JMeterVersion=5.2.0-SNAPSHOT 7becdca
    java.version=1.8.0_152
    java.vm.name=Java HotSpot(TM) 64-Bit Server VM
    java.vendor=Oracle Corporation
    java.home=F:\jenkins\tools\java\latest1.8\jre
    file.encoding=windows-1252
    default encoding=windows-1252
    user.home=C:\Users\jenkins
    user.dir=F:\jenkins\jenkins-slave\workspace\JMeter Windows\src\components
    user.language=en
    user.region=null
    user.country=US
    user.variant=
    Locale=en_US
    java.class.version=52.0
    java.awt.headless=
    os.name=Windows Server 2016
    os.version=10.0
    os.arch=amd64
    java.class.path=F:\jenkins\jenkins-slave\workspace\JMeter Windows\src\components\build\classes\java\test;F:\jenkins\jenkins-slave\workspace\JMeter
Windows\src\components\build\classes\groovy\test;F:\jenkins\jenkins-slave\workspace\JMeter
Windows\src\components\build\resources\test;F:\jenkins\jenkins-slave\workspace\JMeter Windows\src\components\build\classes\java\main;F:\jenkins\jenkins-slave\workspace\JMeter
Windows\src\components\build\classes\groovy\main;F:\jenkins\jenkins-slave\workspace\JMeter
Windows\src\components\build\resources\main;F:\jenkins\jenkins-slave\workspace\JMeter Windows\src\core\build\libs\ApacheJMeter_core.jar;F:\jenkins\jenkins-slave\workspace\JMeter
Windows\src\core\build\libs\ApacheJMeter_core-test.jar;F:\jenkins\jenkins-slave\workspace\JMeter
Windows\src\jorphan\build\libs\jorphan.jar;F:\jenkins\jenkins-slave\workspace\JMeter Windows\src\jorphan\build\libs\jorphan-test.jar;C:\Users\jenkins\.gradle\caches\modules-2\files-2.1\org.apache-extras.beanshell\bsh\2.0b6\fb418f9b33a0b951e9a2978b4b6ee93b2707e72f\bsh-2.0b6.jar;C:\Users\jenkins\.gradle\caches\modules-2\files-2.1\javax.mail\mail\1.5.0-b01\c128515e42609622ce3f7dc0b431026d80bdb688\mail-1.5.0-b01.jar;C:\Users\jenkins\.gradle\caches\modules-2\files-2.1\com.github.ben-manes.caffeine\caffeine\2.6.2\c8fd8817f9d2b2ced82f8968e0dd943aab557de0\caffeine-2.6.2.jar;C:\Users\jenkins\.gradle\caches\modules-2\files-2.1\jcharts\jcharts\0.7.5\496f4515d4eae91a43bde1bc7a965fba500acbbc\jcharts-0.7.5.jar;C:\Users\jenkins\.gradle\caches\modules-2\files-2.1\oro\oro\2.0.8\5592374f834645c4ae250f4c9fbb314c9369d698\oro-2.0.8.jar;C:\Users\jenkins\.gradle\caches\modules-2\files-2.1\com.jayway.jsonpath\json-path\2.4.0\765a4401ceb2dc8d40553c2075eb80a8fa35c2ae\json-path-2.4.0.jar;C:\Users\jenkins\.gradle\caches\modules-2\files-2.1\net.minidev\json-smart\2.3\7396407491352ce4fa30de92efb158adb76b5b\json-smart-2.3.jar;C:\Users\jenkins\.gradle\caches\modules-2\files-2.1\net.minidev\accessors-smart\1.2\c592b500269bfde36096641b01238a8350f8aa31\accessors-smart-1.2.jar;C:\Users\jenkins\.gradle\caches\modules-2\files-2.1\org.apache.commons\commons-pool2\2.6.0\df5f4f61183daa8c4c1a9361c7b3ce2b67218eb2\commons-pool2-2.6.0.jar;C:\Users\jenkins\.gradle\caches\modules-2\files-2.1\org.apache.httpcomponents\httpasyncclient\4.1.4\f3a3240681faae3fa46b573a4c7e50cec9db0d86\httpasyncclient-4.1.4.jar;C:\Users\jenkins\.gradle\caches\modules-2\files-2.1\org.apache.httpcomponents\httpclient\4.5.8\c27c9d6f15435dc2b6947112027b418b0eef32b9\httpclient-4.5.8.jar;C:\Users\jenkins\.gradle\caches\modules-2\files-2.1\commons-codec\commons-codec\1.11\3acb4705652e16236558f0f4f2192cc33c3bd189\commons-codec-1.11.jar;C:\Users\jenkins\.gradle\caches\modules-2\files-2.1\org.jodd\jodd-lagarto\5.0.6\c3a6ac8cf589b73c0f87de16534ffbb9f397bfc\jodd-lagarto-5.0.6.jar;C:\Users\jenkins\.gradle\caches\modules-2\files-2.1\org.jodd\jodd-log\5.0.6\5af71ee33f67d45c6f2d3965e1d7f069b9100b90\jodd-log-5.0.6.jar;C:\Users\jenkins\.gradle\caches\modules-2\files-2.1\org.apache.httpcomponents\httpcore-nio\4.4.11\7d0a97d01d39cff9aa3e6db81f21fddb2435f4e6\httpcore-nio-4.4.11.jar;C:\Users\jenkins\.gradle\caches\modules-2\files-2.1\org.jsoup\jsoup\1.11.3\36da09a8f68484523fa2aaa100399d612b247d67\jsoup-1.11.3.jar;C:\Users\jenkins\.gradle\caches\modules-2\files-2.1\org.apache.commons\commons-text\1.6\ba72cf0c40cf701e972fe7720ae844629f4ecca2\commons-text-1.6.jar;C:\Users\jenkins\.gradle\caches\modules-2\files-2.1\org.apache.commons\commons-lang3\3.8.1\6505a72a097d9270f7a9e7bf42c4238283247755\commons-lang3-3.8.1.jar;C:\Users\jenkins\.gradle\caches\modules-2\files-2.1\net.sf.jtidy\jtidy\r938\ab08d87a225a715a69107732b67f21e1da930349\jtidy-r938.jar;C:\Users\jenkins\.gradle\caches\modules-2\files-2.1\commons-collections\commons-collections\3.2.2\8ad72fe39fa8c91eaaf12aadb21e0c3661fe26d5\commons-collections-3.2.2.jar;C:\Users\jenkins\.gradle\caches\modules-2\files-2.1\org.apache.commons\commons-math3\3.6.1\e4ba98f1d4b3c80ec46392f25e094a6a2e58fcbf\commons-math3-3.6.1.jar;C:\Users\jenkins\.gradle\caches\modules-2\files-2.1\org.apache.xmlgraphics\xmlgraphics-commons\2.3\f0b77d80c4d8f02538512b4d505af0cf5286eb7f\xmlgraphics-commons-2.3.jar;C:\Users\jenkins\.gradle\caches\modules-2\files-2.1\commons-io\commons-io\2.6\815893df5f31da2ece4040fe0a12fd44b577afaf\commons-io-2.6.jar;C:\Users\jenkins\.gradle\caches\modules-2\files-2.1\com.sun.activation\javax.activation\1.2.0\bf744c1e2776ed1de3c55c8dac1057ec331ef744\javax.activation-1.2.0.jar;C:\Users\jenkins\.gradle\caches\modules-2\files-2.1\org.spockframework\spock-core\1.2-groovy-2.4\799953495449acd81af8670a9bdf60987067fa88\spock-core-1.2-groovy-2.4.jar;C:\Users\jenkins\.gradle\caches\modules-2\files-2.1\junit\junit\4.12\2973d150c0dc1fefe998f834810d68f278ea58ec\junit-4.12.jar;C:\Users\jenkins\.gradle\caches\modules-2\files-2.1\cglib\cglib-nodep\3.2.9\27ca91ebc2b82f844e62a7ba8c2c1fdf9b84fa80\cglib-nodep-3.2.9.jar;C:\Users\jenkins\.gradle\caches\modules-2\files-2.1\org.objenesis\objenesis\2.6\639033469776fd37c08358c6b92a4761feb2af4b\objenesis-2.6.jar;C:\Users\jenkins\.gradle\caches\modules-2\files-2.1\org.bouncycastle\bcmail-jdk15on\1.60\df0250131a6e85e546ec5b1bf964f7f2ff3a42fc\bcmail-jdk15on-1.60.jar;C:\Users\jenkins\.gradle\caches\modules-2\files-2.1\org.bouncycastle\bcpkix-jdk15on\1.60\d0c46320fbc07be3a24eb13a56cee4e3d38e0c75\bcpkix-jdk15on-1.60.jar;C:\Users\jenkins\.gradle\caches\modules-2\files-2.1\org.bouncycastle\bcprov-jdk15on\1.60\bd47ad3bd14b8e82595c7adaa143501e60842a84\bcprov-jdk15on-1.60.jar;F:\jenkins\jenkins-slave\workspace\JMeter
Windows\src\launcher\build\libs\ApacheJMeter.jar;C:\Users\jenkins\.gradle\caches\modules-2\files-2.1\bsf\bsf\2.4.0\658f324024bb473c4d15d18b855676fa817353e9\bsf-2.4.0.jar;C:\Users\jenkins\.gradle\caches\modules-2\files-2.1\com.fifesoft\rsyntaxtextarea\3.0.2\f72f90937fcd7a1170781ebcedd3f181d37e0d66\rsyntaxtextarea-3.0.2.jar;C:\Users\jenkins\.gradle\caches\modules-2\files-2.1\com.thoughtworks.xstream\xstream\1.4.11\641cc7d58c7d8204f6cbcb4a79f7c3163b4883c2\xstream-1.4.11.jar;C:\Users\jenkins\.gradle\caches\modules-2\files-2.1\org.apache.logging.log4j\log4j-1.2-api\2.11.1\3aba3398fe064a3eab4331f88161c7480e848418\log4j-1.2-api-2.11.1.jar;C:\Users\jenkins\.gradle\caches\modules-2\files-2.1\org.apache.logging.log4j\log4j-slf4j-impl\2.11.1\4b41b53a3a2d299ce381a69d165381ca19f62912\log4j-slf4j-impl-2.11.1.jar;C:\Users\jenkins\.gradle\caches\modules-2\files-2.1\org.apache.logging.log4j\log4j-core\2.11.1\592a48674c926b01a9a747c7831bcd82a9e6d6e4\log4j-core-2.11.1.jar;C:\Users\jenkins\.gradle\caches\modules-2\files-2.1\org.apache.logging.log4j\log4j-api\2.11.1\268f0fe4df3eefe052b57c87ec48517d64fb2a10\log4j-api-2.11.1.jar;C:\Users\jenkins\.gradle\caches\modules-2\files-2.1\xalan\xalan\2.7.2\d55d3f02a56ec4c25695fe67e1334ff8c2ecea23\xalan-2.7.2.jar;C:\Users\jenkins\.gradle\caches\modules-2\files-2.1\net.sf.saxon\Saxon-HE\9.9.1-1\829d62a587108b9d308f153507290e848d242421\Saxon-HE-9.9.1-1.jar;C:\Users\jenkins\.gradle\caches\modules-2\files-2.1\org.slf4j\jcl-over-slf4j\1.7.25\f8c32b13ff142a513eeb5b6330b1588dcb2c0461\jcl-over-slf4j-1.7.25.jar;C:\Users\jenkins\.gradle\caches\modules-2\files-2.1\com.fasterxml.jackson.core\jackson-databind\2.9.9\d6eb9817d9c7289a91f043ac5ee02a6b3cc86238\jackson-databind-2.9.9.jar;C:\Users\jenkins\.gradle\caches\modules-2\files-2.1\com.fasterxml.jackson.core\jackson-annotations\2.9.9\2ea299c145207161c212e28abbc8f513fa245940\jackson-annotations-2.9.9.jar;C:\Users\jenkins\.gradle\caches\modules-2\files-2.1\com.fasterxml.jackson.core\jackson-core\2.9.9\bfff5af9fb8347d26bbb7959cb9b4fe9a2b0ca5e\jackson-core-2.9.9.jar;C:\Users\jenkins\.gradle\caches\modules-2\files-2.1\org.freemarker\freemarker\2.3.28\7200064467a935052f99d114c2c05c3d189bc6d6\freemarker-2.3.28.jar;C:\Users\jenkins\.gradle\caches\modules-2\files-2.1\org.mozilla\rhino\1.7.10\24650bd98b1041df2eb1be5cb64dd1ad5b2e7c55\rhino-1.7.10.jar;C:\Users\jenkins\.gradle\caches\modules-2\files-2.1\org.apache.tika\tika-core\1.21\3c297fba4e75b1eeba2ecd6fabb7dbe13dfcb71\tika-core-1.21.jar;C:\Users\jenkins\.gradle\caches\modules-2\files-2.1\org.jodd\jodd-props\5.0.6\78f111d5ddb4d245b4cb5fc3adbd4128835399e\jodd-props-5.0.6.jar;C:\Users\jenkins\.gradle\caches\modules-2\files-2.1\org.jodd\jodd-core\5.0.6\af9ca4122b13708ea581f55654cc31fd688e2b7d\jodd-core-5.0.6.jar;C:\Users\jenkins\.gradle\caches\modules-2\files-2.1\org.codehaus.groovy\groovy-all\2.4.16\aa30a6479a3f6efc2ba8cd810cc2caf22a613b19\groovy-all-2.4.16.jar;C:\Users\jenkins\.gradle\caches\modules-2\files-2.1\org.apache.tika\tika-parsers\1.21\aa9a02883e567c7d550f68ada85024fa37525ef5\tika-parsers-1.21.jar;C:\Users\jenkins\.gradle\caches\modules-2\files-2.1\xerces\xercesImpl\2.12.0\f02c844149fd306601f20e0b34853a670bef7fa2\xercesImpl-2.12.0.jar;C:\Users\jenkins\.gradle\caches\modules-2\files-2.1\xalan\serializer\2.7.2\24247f3bb052ee068971393bdb83e04512bb1c3c\serializer-2.7.2.jar;C:\Users\jenkins\.gradle\caches\modules-2\files-2.1\xml-apis\xml-apis\1.4.01\3789d9fada2d3d458c4ba2de349d48780f381ee3\xml-apis-1.4.01.jar;C:\Users\jenkins\.gradle\caches\modules-2\files-2.1\org.slf4j\slf4j-api\1.7.25\da76ca59f6a57ee3102f8f9bd9cee742973efa8a\slf4j-api-1.7.25.jar;C:\Users\jenkins\.gradle\caches\modules-2\files-2.1\org.apache.httpcomponents\httpcore\4.4.11\de748cf874e4e193b42eceea9fe5574fabb9d4df\httpcore-4.4.11.jar;C:\Users\jenkins\.gradle\caches\modules-2\files-2.1\org.hamcrest\hamcrest-core\1.3\42a25dc3219429f0e5d060061f71acb49bf010a0\hamcrest-core-1.3.jar;C:\Users\jenkins\.gradle\caches\modules-2\files-2.1\xmlpull\xmlpull\1.1.3.1\2b8e230d2ab644e4ecaa94db7cdedbc40c805dfa\xmlpull-1.1.3.1.jar;C:\Users\jenkins\.gradle\caches\modules-2\files-2.1\xpp3\xpp3_min\1.1.4c\19d4e90b43059058f6e056f794f0ea4030d60b86\xpp3_min-1.1.4c.jar;C:\Users\jenkins\.gradle\caches\modules-2\files-2.1\org.ow2.asm\asm\7.1\fa29aa438674ff19d5e1386d2c3527a0267f291e\asm-7.1.jar;C:\Users\jenkins\.gradle\caches\modules-2\files-2.1\commons-logging\commons-logging\1.2\4bfc12adfe4842bf07b657f0369c4cb522955686\commons-logging-1.2.jar

> Task :src:protocol:http:jar
> Task :src:protocol:http:checkstyleMain

> Task :src:core:test

251 tests completed, 13 failed

> Task :src:core:test FAILED
Checksum computation time: 1049, files processed: 162, bytes processed: 104162574

FAILURE: Build failed with an exception.

* What went wrong:
Execution failed for task ':src:core:test'.
> There were failing tests. See the report at: file:///F:/jenkins/jenkins-slave/workspace/JMeter%20Windows/src/core/build/reports/tests/test/index.html

* Try:
Run with --stacktrace option to get the stack trace. Run with --info or --debug option to
get more log output. Run with --scan to get full insights.

* Get more help at https://help.gradle.org

Deprecated Gradle features were used in this build, making it incompatible with Gradle 6.0.
Use '--warning-mode all' to show the individual deprecation warnings.
See https://docs.gradle.org/5.5.1/userguide/command_line_interface.html#sec:command_line_warnings

BUILD FAILED in 9m 22s
135 actionable tasks: 135 executed
Could not open/create prefs root node Software\JavaSoft\Prefs at root 0x80000002. Windows
RegCreateKeyEx(...) returned error code 5.
Build step 'Invoke Gradle script' changed build result to FAILURE
Build step 'Invoke Gradle script' marked build as failure

Mime
View raw message