jmeter-dev mailing list archives

Site index · List index
Message view « Date » · « Thread »
Top « Date » · « Thread »
From Apache Jenkins Server <jenk...@builds.apache.org>
Subject Build failed in Jenkins: JMeter-trunk #7272
Date Fri, 02 Aug 2019 15:10:28 GMT
See <https://builds.apache.org/job/JMeter-trunk/7272/display/redirect>

------------------------------------------
Started by user vladimirsitnikov
[EnvInject] - Loading node environment variables.
Building remotely on H37 (ubuntu xenial) in workspace <https://builds.apache.org/job/JMeter-trunk/ws/>
No credentials specified
 > git rev-parse --is-inside-work-tree # timeout=10
Fetching changes from the remote Git repository
 > git config remote.origin.url https://gitbox.apache.org/repos/asf/jmeter.git # timeout=10
Fetching upstream changes from https://gitbox.apache.org/repos/asf/jmeter.git
 > git --version # timeout=10
 > git fetch --tags --progress https://gitbox.apache.org/repos/asf/jmeter.git +refs/heads/*:refs/remotes/origin/*
 > git rev-parse refs/remotes/origin/master^{commit} # timeout=10
 > git rev-parse refs/remotes/origin/origin/master^{commit} # timeout=10
Checking out Revision 41bad20e9d495240e140da6cbdbf5d9e2c8d3123 (refs/remotes/origin/master)
 > git config core.sparsecheckout # timeout=10
 > git checkout -f 41bad20e9d495240e140da6cbdbf5d9e2c8d3123
Commit message: "Add .editorconfig file for common editor settings"
 > git rev-list --no-walk 41bad20e9d495240e140da6cbdbf5d9e2c8d3123 # timeout=10
[locks-and-latches] Checking to see if we really have the locks
[locks-and-latches] Have all the locks, build can start
Injecting SonarQube environment variables using the configuration: ASF Sonar Analysis
[Gradle] - Launching build.
[JMeter-trunk] $ gradle check createDist
Generating JAR file 'gradle-kotlin-dsl-extensions-0.17.5-4.8.1.jar'
Download https://plugins.gradle.org/m2/com/github/vlsi/gradle/checksum-dependency-plugin/1.19.0/checksum-dependency-plugin-1.19.0.pom
Download https://plugins.gradle.org/m2/com/github/vlsi/gradle/checksum-dependency-plugin/1.19.0/checksum-dependency-plugin-1.19.0.jar
e: <https://builds.apache.org/job/JMeter-trunk/ws/buildSrc/settings.gradle.kts>:59:12:
Unresolved reference: BigInteger

FAILURE: Build failed with an exception.

* Where:
Settings file '<https://builds.apache.org/job/JMeter-trunk/ws/buildSrc/settings.gradle.kts'>
line: 59

* What went wrong:
Script compilation error:

  Line 59:     return BigInteger(1, md.digest()).toString(16).toUpperCase()
                      ^ Unresolved reference: BigInteger

1 error

* Try:
Run with --stacktrace option to get the stack trace. Run with --info or --debug option to
get more log output. Run with --scan to get full insights.

* Get more help at https://help.gradle.org

BUILD FAILED in 26s
Build step 'Invoke Gradle script' changed build result to FAILURE
Build step 'Invoke Gradle script' marked build as failure
[locks-and-latches] Releasing all the locks
[locks-and-latches] All the locks released
Archiving artifacts
Recording test results
ERROR: Step ?Publish JUnit test result report? failed: No test report files were found. Configuration
error?

Mime
View raw message