jmeter-dev mailing list archives

Site index · List index
Message view « Date » · « Thread »
Top « Date » · « Thread »
From Apache Jenkins Server <jenk...@builds.apache.org>
Subject Build failed in Jenkins: JMeter-trunk #7275
Date Fri, 02 Aug 2019 15:51:51 GMT
See <https://builds.apache.org/job/JMeter-trunk/7275/display/redirect?page=changes>

Changes:

[sitnikov.vladimir] Exclude *.sxi and *.sxw from Apache RAT verification

------------------------------------------
[...truncated 52.35 KB...]
        at org.apache.jorphan.gui.MinMaxLongRenderer.<init>(MinMaxLongRenderer.java:35)
        at org.apache.jorphan.gui.MinMaxLongRendererTest$1.<init>(MinMaxLongRendererTest.java:57)
        at org.apache.jorphan.gui.MinMaxLongRendererTest.testRendering(MinMaxLongRendererTest.java:57)

> Task :src:protocol:native:compileJava

> Task :src:protocol:tcp:compileJava
Note: Some input files use or override a deprecated API.
Note: Recompile with -Xlint:deprecation for details.

> Task :src:protocol:native:classes
> Task :src:protocol:tcp:classes
> Task :src:protocol:junit-sample:compileJava
> Task :src:protocol:junit-sample:classes
> Task :src:protocol:mongodb:compileJava
> Task :src:protocol:mongodb:classes

> Task :src:protocol:ftp:compileJava
Note: <https://builds.apache.org/job/JMeter-trunk/ws/src/protocol/ftp/src/main/java/org/apache/jmeter/protocol/ftp/sampler/FTPSampler.java>
uses or overrides a deprecated API.
Note: Recompile with -Xlint:deprecation for details.

> Task :src:protocol:junit:compileJava
> Task :src:protocol:ldap:compileJava
> Task :src:protocol:native:jar
> Task :src:protocol:junit:classes
> Task :src:protocol:jdbc:compileJava
> Task :src:protocol:java:compileJava
> Task :src:protocol:java:classes
> Task :src:protocol:jdbc:compileGroovy NO-SOURCE
> Task :src:protocol:jdbc:classes
> Task :src:protocol:ldap:classes
> Task :src:protocol:junit-sample:jar
> Task :src:protocol:ftp:classes
> Task :src:protocol:junit:jar
> Task :src:protocol:mongodb:jar
> Task :src:protocol:tcp:jar
> Task :src:protocol:java:jar
> Task :src:protocol:ftp:jar
> Task :src:protocol:jdbc:jar

> Task :src:protocol:jms:compileJava
Note: Some input files use or override a deprecated API.
Note: Recompile with -Xlint:deprecation for details.

> Task :src:protocol:jms:classes
> Task :src:protocol:ldap:jar
> Task :src:protocol:jms:jar
> Task :src:protocol:mail:compileJava
> Task :src:protocol:mail:classes
> Task :src:protocol:mail:jar

> Task :src:core:compileTestJava
Note: <https://builds.apache.org/job/JMeter-trunk/ws/src/core/src/test/java/org/apache/jmeter/listeners/TestResultAction.java>
uses or overrides a deprecated API.
Note: Recompile with -Xlint:deprecation for details.

> Task :src:protocol:junit-sample:checkstyleMain
> Task :src:protocol:junit-sample:spotbugsMain SKIPPED
> Task :src:protocol:ftp:checkstyleMain
> Task :src:protocol:ftp:spotbugsMain SKIPPED
> Task :src:protocol:junit:checkstyleMain
> Task :src:protocol:junit:spotbugsMain SKIPPED
> Task :src:protocol:mongodb:checkstyleMain
> Task :src:protocol:mongodb:spotbugsMain SKIPPED
> Task :src:protocol:native:checkstyleMain
> Task :src:protocol:native:spotbugsMain SKIPPED
> Task :src:protocol:java:checkstyleMain
> Task :src:protocol:java:spotbugsMain SKIPPED
> Task :src:protocol:tcp:checkstyleMain
> Task :src:protocol:tcp:spotbugsMain SKIPPED
> Task :src:protocol:jdbc:checkstyleMain
> Task :src:protocol:jdbc:spotbugsMain SKIPPED
> Task :src:protocol:ldap:checkstyleMain
> Task :src:protocol:ldap:spotbugsMain SKIPPED
> Task :src:protocol:mail:checkstyleMain
> Task :src:protocol:mail:spotbugsMain SKIPPED
> Task :src:protocol:jms:checkstyleMain
> Task :src:protocol:jms:spotbugsMain SKIPPED
> Task :src:core:compileTestGroovy
> Task :src:core:testClasses
> Task :src:core:testJar
> Task :src:protocol:junit-sample:compileTestJava NO-SOURCE
> Task :src:protocol:junit-sample:testClasses UP-TO-DATE
> Task :src:protocol:junit-sample:checkstyleTest NO-SOURCE
> Task :src:protocol:junit-sample:spotbugsTest SKIPPED
> Task :src:protocol:junit-sample:test NO-SOURCE
> Task :src:protocol:junit-sample:check
> Task :src:protocol:native:compileTestJava
> Task :src:protocol:ftp:compileTestJava
> Task :src:protocol:native:testClasses
> Task :src:protocol:ftp:testClasses
> Task :src:protocol:native:testJar
> Task :src:protocol:java:compileTestJava
> Task :src:protocol:java:testClasses
> Task :src:protocol:java:testJar
> Task :src:protocol:ftp:testJar
> Task :src:protocol:mail:compileTestJava
> Task :src:protocol:mail:testClasses
> Task :src:protocol:tcp:compileTestJava
> Task :src:protocol:tcp:testClasses
> Task :src:protocol:mail:testJar
> Task :src:protocol:tcp:testJar
> Task :src:protocol:ldap:compileTestJava
> Task :src:protocol:ldap:testClasses
> Task :src:protocol:junit:compileTestJava
> Task :src:protocol:junit:testClasses
> Task :src:protocol:ldap:testJar
> Task :src:protocol:jdbc:compileTestJava
> Task :src:protocol:mongodb:compileTestJava
> Task :src:protocol:mongodb:testClasses
> Task :src:protocol:junit:testJar
> Task :src:protocol:jms:compileTestJava
> Task :src:protocol:jms:testClasses
> Task :src:protocol:mongodb:testJar
> Task :src:protocol:jms:testJar
> Task :src:protocol:mongodb:checkstyleTest
> Task :src:protocol:mongodb:spotbugsTest SKIPPED
> Task :src:protocol:java:checkstyleTest
> Task :src:protocol:java:spotbugsTest SKIPPED
> Task :src:protocol:ldap:checkstyleTest
> Task :src:protocol:ldap:spotbugsTest SKIPPED
> Task :src:protocol:junit:checkstyleTest
> Task :src:protocol:junit:spotbugsTest SKIPPED
> Task :src:protocol:native:checkstyleTest
> Task :src:protocol:native:spotbugsTest SKIPPED
> Task :src:protocol:mail:checkstyleTest
> Task :src:protocol:mail:spotbugsTest SKIPPED
> Task :src:protocol:ftp:checkstyleTest
> Task :src:protocol:ftp:spotbugsTest SKIPPED
> Task :src:protocol:tcp:checkstyleTest
> Task :src:protocol:tcp:spotbugsTest SKIPPED
> Task :src:protocol:jms:checkstyleTest
> Task :src:protocol:jms:spotbugsTest SKIPPED
> Task :src:protocol:jdbc:compileTestGroovy
> Task :src:protocol:jdbc:testClasses
> Task :src:protocol:jdbc:testJar
> Task :src:protocol:jdbc:checkstyleTest
> Task :src:protocol:jdbc:spotbugsTest SKIPPED

> Task :src:components:compileJava
Note: Some input files use or override a deprecated API.
Note: Recompile with -Xlint:deprecation for details.
Note: Some input files use unchecked or unsafe operations.
Note: Recompile with -Xlint:unchecked for details.

> Task :src:protocol:native:test
> Task :src:protocol:ftp:test
> Task :src:protocol:ftp:check
> Task :src:protocol:native:check
> Task :src:protocol:mongodb:test
> Task :src:protocol:mongodb:check
> Task :src:protocol:java:test
> Task :src:protocol:junit:test
> Task :src:protocol:java:check
> Task :src:protocol:junit:check
> Task :src:protocol:tcp:test
> Task :src:protocol:tcp:check
> Task :src:protocol:mail:test
> Task :src:protocol:mail:check

> Task :src:protocol:ldap:test FAILED

org.apache.jmeter.protocol.ldap.config.gui.PackageTest > testLDAPArgumentCreation FAILED
    java.awt.AWTError: Can't connect to X11 window server using ':0.0' as the value of the
DISPLAY variable.
        at sun.awt.X11GraphicsEnvironment.initDisplay(Native Method)
        at sun.awt.X11GraphicsEnvironment.access$200(X11GraphicsEnvironment.java:65)
        at sun.awt.X11GraphicsEnvironment$1.run(X11GraphicsEnvironment.java:115)
        at java.security.AccessController.doPrivileged(Native Method)
        at sun.awt.X11GraphicsEnvironment.<clinit>(X11GraphicsEnvironment.java:74)
        at java.lang.Class.forName0(Native Method)
        at java.lang.Class.forName(Class.java:264)
        at java.awt.GraphicsEnvironment.createGE(GraphicsEnvironment.java:103)
        at java.awt.GraphicsEnvironment.getLocalGraphicsEnvironment(GraphicsEnvironment.java:82)
        at sun.awt.X11.XToolkit.<clinit>(XToolkit.java:126)
        at java.lang.Class.forName0(Native Method)
        at java.lang.Class.forName(Class.java:264)
        at java.awt.Toolkit$2.run(Toolkit.java:860)
        at java.awt.Toolkit$2.run(Toolkit.java:855)
        at java.security.AccessController.doPrivileged(Native Method)
        at java.awt.Toolkit.getDefaultToolkit(Toolkit.java:854)
        at sun.swing.SwingUtilities2.getSystemMnemonicKeyMask(SwingUtilities2.java:2020)
        at javax.swing.plaf.basic.BasicLookAndFeel.initComponentDefaults(BasicLookAndFeel.java:1158)
        at javax.swing.plaf.metal.MetalLookAndFeel.initComponentDefaults(MetalLookAndFeel.java:431)
        at javax.swing.plaf.basic.BasicLookAndFeel.getDefaults(BasicLookAndFeel.java:148)
        at javax.swing.plaf.metal.MetalLookAndFeel.getDefaults(MetalLookAndFeel.java:1577)
        at javax.swing.UIManager.setLookAndFeel(UIManager.java:539)
        at javax.swing.UIManager.setLookAndFeel(UIManager.java:579)
        at javax.swing.UIManager.initializeDefaultLAF(UIManager.java:1349)
        at javax.swing.UIManager.initialize(UIManager.java:1459)
        at javax.swing.UIManager.maybeInitialize(UIManager.java:1426)
        at javax.swing.UIManager.getUI(UIManager.java:1006)
        at javax.swing.JPanel.updateUI(JPanel.java:126)
        at javax.swing.JPanel.<init>(JPanel.java:86)
        at javax.swing.JPanel.<init>(JPanel.java:109)
        at javax.swing.JPanel.<init>(JPanel.java:117)
        at org.apache.jmeter.gui.AbstractJMeterGuiComponent.<init>(AbstractJMeterGuiComponent.java:77)
        at org.apache.jmeter.config.gui.AbstractConfigGui.<init>(AbstractConfigGui.java:34)
        at org.apache.jmeter.protocol.ldap.config.gui.LDAPArgumentsPanel.<init>(LDAPArgumentsPanel.java:94)
        at org.apache.jmeter.protocol.ldap.config.gui.LDAPArgumentsPanel.<init>(LDAPArgumentsPanel.java:85)
        at org.apache.jmeter.protocol.ldap.config.gui.PackageTest.testLDAPArgumentCreation(PackageTest.java:36)

2 tests completed, 1 failed

> Task :src:protocol:jms:test
> Task :src:protocol:jdbc:test
> Task :src:core:checkstyleMain

> Task :src:jorphan:test

208 tests completed, 5 failed, 2 skipped

> Task :src:jorphan:test FAILED
Checksum computation time: 1302, files processed: 154, bytes processed: 101142533

FAILURE: Build completed with 2 failures.

1: Task failed with an exception.
-----------
* What went wrong:
Execution failed for task ':src:protocol:ldap:test'.
> There were failing tests. See the report at: file://<https://builds.apache.org/job/JMeter-trunk/ws/src/protocol/ldap/build/reports/tests/test/index.html>

* Try:
Run with --stacktrace option to get the stack trace. Run with --info or --debug option to
get more log output. Run with --scan to get full insights.
==============================================================================

2: Task failed with an exception.
-----------
* What went wrong:
Execution failed for task ':src:jorphan:test'.
> There were failing tests. See the report at: file://<https://builds.apache.org/job/JMeter-trunk/ws/src/jorphan/build/reports/tests/test/index.html>

* Try:
Run with --stacktrace option to get the stack trace. Run with --info or --debug option to
get more log output. Run with --scan to get full insights.
==============================================================================

* Get more help at https://help.gradle.org

Deprecated Gradle features were used in this build, making it incompatible with Gradle 6.0.
Use '--warning-mode all' to show the individual deprecation warnings.
See https://docs.gradle.org/5.5.1/userguide/command_line_interface.html#sec:command_line_warnings

BUILD FAILED in 2m 38s
116 actionable tasks: 116 executed
Build step 'Invoke Gradle script' changed build result to FAILURE
Build step 'Invoke Gradle script' marked build as failure
[locks-and-latches] Releasing all the locks
[locks-and-latches] All the locks released
Archiving artifacts
Recording test results

Mime
View raw message