jmeter-dev mailing list archives

Site index · List index
Message view « Date » · « Thread »
Top « Date » · « Thread »
From Apache Jenkins Server <jenk...@builds.apache.org>
Subject Build failed in Jenkins: JMeter-trunk #7301
Date Mon, 12 Aug 2019 23:08:29 GMT
See <https://builds.apache.org/job/JMeter-trunk/7301/display/redirect?page=changes>

Changes:

[sitnikov.vladimir] Avoid use of reflection to modify static final field in SamplerMetric

------------------------------------------
[...truncated 57.32 KB...]
> Task :src:jorphan:testClasses
> Task :src:jorphan:testJar
> Task :src:jorphan:checkstyleMain
> Task :src:jorphan:checkstyleTest
> Task :src:core:compileJava
> Task :src:core:compileGroovy NO-SOURCE
> Task :src:core:classes
> Task :src:core:jar
> Task :src:protocol:native:compileJava
> Task :src:protocol:native:classes
> Task :src:protocol:junit-sample:compileJava

> Task :src:protocol:tcp:compileJava
Note: Some input files use or override a deprecated API.
Note: Recompile with -Xlint:deprecation for details.

> Task :src:protocol:junit-sample:classes
> Task :src:protocol:ldap:compileJava
> Task :src:protocol:tcp:classes
> Task :src:protocol:ldap:classes
> Task :src:protocol:java:compileJava
> Task :src:protocol:java:classes
> Task :src:protocol:native:jar
> Task :src:protocol:junit-sample:jar
> Task :src:protocol:ldap:jar
> Task :src:protocol:tcp:jar
> Task :src:protocol:java:jar

> Task :src:protocol:jms:compileJava
Note: Some input files use or override a deprecated API.
Note: Recompile with -Xlint:deprecation for details.

> Task :src:protocol:jms:classes
> Task :src:protocol:jms:jar
> Task :src:protocol:junit:compileJava
> Task :src:protocol:junit:classes
> Task :src:protocol:junit:jar

> Task :src:protocol:ftp:compileJava
Note: <https://builds.apache.org/job/JMeter-trunk/ws/src/protocol/ftp/src/main/java/org/apache/jmeter/protocol/ftp/sampler/FTPSampler.java>
uses or overrides a deprecated API.
Note: Recompile with -Xlint:deprecation for details.

> Task :src:protocol:ftp:classes
> Task :src:protocol:mongodb:compileJava
> Task :src:protocol:mongodb:classes
> Task :src:protocol:ftp:jar
> Task :src:protocol:jdbc:compileJava
> Task :src:protocol:mongodb:jar
> Task :src:protocol:jdbc:compileGroovy NO-SOURCE
> Task :src:protocol:jdbc:classes
> Task :src:protocol:jdbc:jar
> Task :src:protocol:mail:compileJava
> Task :src:protocol:mail:classes
> Task :src:protocol:mail:jar
> Task :src:protocol:junit-sample:checkstyleMain

> Task :src:core:compileTestJava
Note: <https://builds.apache.org/job/JMeter-trunk/ws/src/core/src/test/java/org/apache/jmeter/listeners/TestResultAction.java>
uses or overrides a deprecated API.
Note: Recompile with -Xlint:deprecation for details.

> Task :src:protocol:native:checkstyleMain
> Task :src:protocol:mongodb:checkstyleMain
> Task :src:protocol:ftp:checkstyleMain
> Task :src:protocol:tcp:checkstyleMain
> Task :src:protocol:junit:checkstyleMain
> Task :src:protocol:java:checkstyleMain
> Task :src:protocol:jdbc:checkstyleMain
> Task :src:protocol:ldap:checkstyleMain
> Task :src:protocol:mail:checkstyleMain
> Task :src:protocol:jms:checkstyleMain
> Task :src:core:compileTestGroovy
> Task :src:core:testClasses
> Task :src:core:testJar
> Task :src:components:compileJava
> Task :src:components:compileGroovy NO-SOURCE
> Task :src:components:classes
> Task :src:examples:compileJava
> Task :src:examples:classes
> Task :src:generator:compileJava
> Task :src:generator:classes
> Task :src:generator:jar
> Task :src:generator:checkstyleMain
> Task :src:generator:compileTestJava NO-SOURCE
> Task :src:generator:testClasses UP-TO-DATE
> Task :src:generator:checkstyleTest NO-SOURCE
> Task :src:generator:assemble
> Task :src:examples:checkstyleMain
> Task :src:examples:compileTestJava NO-SOURCE
> Task :src:examples:testClasses UP-TO-DATE
> Task :src:examples:checkstyleTest NO-SOURCE
> Task :src:examples:jar
> Task :src:examples:assemble

> Task :src:functions:compileJava
Note: <https://builds.apache.org/job/JMeter-trunk/ws/src/functions/src/main/java/org/apache/jmeter/functions/StringFromFile.java>
uses or overrides a deprecated API.
Note: Recompile with -Xlint:deprecation for details.

> Task :src:functions:compileGroovy NO-SOURCE
> Task :src:functions:classes
> Task :src:functions:jar
> Task :src:jorphan:spotbugsMain
> Task :src:functions:checkstyleMain
> Task :src:functions:assemble

> Task :src:protocol:junit-sample:spotbugsMain
SpotBugs rule violations were found. See the report at: file://<https://builds.apache.org/job/JMeter-trunk/ws/src/protocol/junit-sample/build/reports/spotbugs/main.xml>

> Task :src:protocol:junit-sample:compileTestJava NO-SOURCE
> Task :src:protocol:junit-sample:testClasses UP-TO-DATE
> Task :src:protocol:junit-sample:checkstyleTest NO-SOURCE
> Task :src:protocol:junit-sample:spotbugsTest NO-SOURCE
> Task :src:protocol:junit-sample:test NO-SOURCE
> Task :src:protocol:junit-sample:check
> Task :src:protocol:junit-sample:assemble
> Task :src:protocol:junit-sample:jacocoTestReport SKIPPED
> Task :src:protocol:native:spotbugsMain
> Task :src:protocol:mongodb:spotbugsMain
> Task :src:protocol:ftp:spotbugsMain
> Task :src:protocol:tcp:spotbugsMain
> Task :src:protocol:junit:spotbugsMain
> Task :src:protocol:java:spotbugsMain
> Task :src:protocol:jdbc:spotbugsMain
> Task :src:protocol:ldap:spotbugsMain
> Task :src:protocol:mail:spotbugsMain
> Task :src:protocol:jms:spotbugsMain
> Task :src:protocol:http:compileJava
> Task :src:protocol:http:compileGroovy NO-SOURCE
> Task :src:protocol:http:classes
> Task :src:dist:compileJava NO-SOURCE
> Task :src:dist:classes UP-TO-DATE
> Task :src:dist-check:compileJava NO-SOURCE
> Task :src:dist:checkstyleMain NO-SOURCE
> Task :src:dist-check:compileGroovy NO-SOURCE
> Task :src:dist-check:classes UP-TO-DATE
> Task :src:dist-check:checkstyleMain NO-SOURCE
> Task :src:dist:jar
> Task :src:dist-check:jar
> Task :src:dist-check:assemble
> Task :src:protocol:http:jar
> Task :src:core:checkstyleMain
> Task :src:components:checkstyleMain

> Task :src:protocol:mongodb:spotbugsMain
SpotBugs rule violations were found. See the report at: file://<https://builds.apache.org/job/JMeter-trunk/ws/src/protocol/mongodb/build/reports/spotbugs/main.xml>

> Task :src:protocol:mongodb:compileTestJava
> Task :src:protocol:mongodb:testClasses
> Task :src:protocol:mongodb:testJar
> Task :src:protocol:mongodb:checkstyleTest
> Task :src:components:compileTestJava
> Task :src:core:checkstyleTest

> Task :src:protocol:jdbc:spotbugsMain
SpotBugs rule violations were found. See the report at: file://<https://builds.apache.org/job/JMeter-trunk/ws/src/protocol/jdbc/build/reports/spotbugs/main.xml>

> Task :src:protocol:jdbc:compileTestJava

> Task :src:protocol:native:spotbugsMain
SpotBugs rule violations were found. See the report at: file://<https://builds.apache.org/job/JMeter-trunk/ws/src/protocol/native/build/reports/spotbugs/main.xml>

> Task :src:protocol:native:compileTestJava
> Task :src:protocol:native:testClasses
> Task :src:protocol:native:testJar

> Task :src:protocol:ftp:spotbugsMain
SpotBugs rule violations were found. See the report at: file://<https://builds.apache.org/job/JMeter-trunk/ws/src/protocol/ftp/build/reports/spotbugs/main.xml>

> Task :src:protocol:http:checkstyleMain
> Task :src:protocol:http:assemble
> Task :src:protocol:native:checkstyleTest
> Task :src:protocol:ftp:compileTestJava
> Task :src:protocol:ftp:testClasses
> Task :src:protocol:ftp:testJar
> Task :src:components:compileTestGroovy
> Task :src:components:testClasses
> Task :src:protocol:ftp:checkstyleTest

> Task :src:protocol:junit:spotbugsMain
SpotBugs rule violations were found. See the report at: file://<https://builds.apache.org/job/JMeter-trunk/ws/src/protocol/junit/build/reports/spotbugs/main.xml>

> Task :src:jorphan:spotbugsMain
SpotBugs rule violations were found. See the report at: file://<https://builds.apache.org/job/JMeter-trunk/ws/src/jorphan/build/reports/spotbugs/main.xml>

> Task :src:protocol:junit:compileTestJava
> Task :src:protocol:junit:testClasses
> Task :src:protocol:junit:testJar
> Task :src:protocol:junit:checkstyleTest

> Task :src:protocol:tcp:spotbugsMain
SpotBugs rule violations were found. See the report at: file://<https://builds.apache.org/job/JMeter-trunk/ws/src/protocol/tcp/build/reports/spotbugs/main.xml>

> Task :src:components:checkstyleTest
[ant:checkstyle] [ERROR] <https://builds.apache.org/job/JMeter-trunk/ws/src/components/src/test/java/org/apache/jmeter/visualizers/backend/SamplerMetricFixedModeTest.java>:23:8:
Unused import - java.lang.reflect.Field. [UnusedImports]
[ant:checkstyle] [ERROR] <https://builds.apache.org/job/JMeter-trunk/ws/src/components/src/test/java/org/apache/jmeter/visualizers/backend/SamplerMetricFixedModeTest.java>:24:8:
Unused import - java.lang.reflect.Modifier. [UnusedImports]
[ant:checkstyle] [ERROR] <https://builds.apache.org/job/JMeter-trunk/ws/src/components/src/test/java/org/apache/jmeter/visualizers/backend/SamplerMetricTimedModeTest.java>:23:8:
Unused import - java.lang.reflect.Field. [UnusedImports]
[ant:checkstyle] [ERROR] <https://builds.apache.org/job/JMeter-trunk/ws/src/components/src/test/java/org/apache/jmeter/visualizers/backend/SamplerMetricTimedModeTest.java>:24:8:
Unused import - java.lang.reflect.Modifier. [UnusedImports]

> Task :src:components:checkstyleTest FAILED
> Task :src:protocol:tcp:compileTestJava
> Task :src:protocol:jdbc:compileTestGroovy

> Task :src:protocol:mail:spotbugsMain
SpotBugs rule violations were found. See the report at: file://<https://builds.apache.org/job/JMeter-trunk/ws/src/protocol/mail/build/reports/spotbugs/main.xml>

> Task :src:protocol:mongodb:spotbugsTest

> Task :src:protocol:jms:spotbugsMain
SpotBugs rule violations were found. See the report at: file://<https://builds.apache.org/job/JMeter-trunk/ws/src/protocol/jms/build/reports/spotbugs/main.xml>

> Task :src:dist:javadocAggregate
> Task :src:protocol:ftp:spotbugsTest
> Task :src:protocol:native:spotbugsTest
> Task :src:protocol:junit:spotbugsTest

> Task :src:jorphan:spotbugsTest
SpotBugs rule violations were found. See the report at: file://<https://builds.apache.org/job/JMeter-trunk/ws/src/jorphan/build/reports/spotbugs/test.xml>

> Task :src:core:spotbugsMain
SpotBugs rule violations were found. See the report at: file://<https://builds.apache.org/job/JMeter-trunk/ws/src/core/build/reports/spotbugs/main.xml>
Checksum computation time: 1218, files processed: 176, bytes processed: 109722341

FAILURE: Build failed with an exception.

* What went wrong:
Execution failed for task ':src:components:checkstyleTest'.
> Checkstyle rule violations were found. See the report at: file://<https://builds.apache.org/job/JMeter-trunk/ws/src/components/build/reports/checkstyle/test.html>
  Checkstyle files with violations: 2
  Checkstyle violations by severity: [error:4]


* Try:
Run with --stacktrace option to get the stack trace. Run with --info or --debug option to
get more log output. Run with --scan to get full insights.

* Get more help at https://help.gradle.org

Deprecated Gradle features were used in this build, making it incompatible with Gradle 6.0.
Use '--warning-mode all' to show the individual deprecation warnings.
See https://docs.gradle.org/5.5.1/userguide/command_line_interface.html#sec:command_line_warnings

BUILD FAILED in 4m 41s
171 actionable tasks: 144 executed, 27 up-to-date
Build step 'Invoke Gradle script' changed build result to FAILURE
Build step 'Invoke Gradle script' marked build as failure
[locks-and-latches] Releasing all the locks
[locks-and-latches] All the locks released
Archiving artifacts
[Fast Archiver] Compressed 32.27 MB of artifacts by 51.3% relative to #7300
Recording test results
ERROR: Step ?Publish JUnit test result report? failed: No test report files were found. Configuration
error?

Mime
View raw message