jmeter-dev mailing list archives

Site index · List index
Message view « Date » · « Thread »
Top « Date » · « Thread »
From Apache Jenkins Server <jenk...@builds.apache.org>
Subject Build failed in Jenkins: JMeter Windows #1427
Date Sat, 03 Aug 2019 14:09:52 GMT
See <https://builds.apache.org/job/JMeter%20Windows/1427/display/redirect?page=changes>

Changes:

[felix.schumacher] Correct javadoc

[felix.schumacher] Use consistent names for methods

[felix.schumacher] Directly return result

[felix.schumacher] Spacepolice

[felix.schumacher] Remove useless method call

[felix.schumacher] Check for result of mkdir

[felix.schumacher] Use long arithmetic all along

[felix.schumacher] spelchack

[sitnikov.vladimir] Fix JMeterTestUtils#setupJMeterHome

------------------------------------------
[...truncated 124.59 KB...]
    java.lang.reflect.Method#invoke at line:498
    org.gradle.internal.dispatch.ReflectionDispatch#dispatch at line:35
    org.gradle.internal.dispatch.ReflectionDispatch#dispatch at line:24
    org.gradle.internal.remote.internal.hub.MessageHubBackedObjectConnection$DispatchWrapper#dispatch
at line:175
    org.gradle.internal.remote.internal.hub.MessageHubBackedObjectConnection$DispatchWrapper#dispatch
at line:157
    org.gradle.internal.remote.internal.hub.MessageHub$Handler#run at line:404
    org.gradle.internal.concurrent.ExecutorPolicy$CatchAndRecordFailures#onExecute at line:63
    org.gradle.internal.concurrent.ManagedExecutorImpl$1#run at line:46
    java.util.concurrent.ThreadPoolExecutor#runWorker at line:1149
    java.util.concurrent.ThreadPoolExecutor$Worker#run at line:624
    org.gradle.internal.concurrent.ThreadFactoryImpl$ManagedThreadRunnable#run at line:55
    java.lang.Thread#run at line:748

    Thread[AWT-Shutdown,5,system], stackTrace:java.lang.Object#wait
    sun.awt.AWTAutoShutdown#run at line:314
    java.lang.Thread#run at line:748

    Thread[main,5,main], stackTrace:sun.misc.Unsafe#park
    java.util.concurrent.locks.LockSupport#park at line:175
    java.util.concurrent.locks.AbstractQueuedSynchronizer#parkAndCheckInterrupt at line:836
    java.util.concurrent.locks.AbstractQueuedSynchronizer#doAcquireSharedInterruptibly at
line:997
    java.util.concurrent.locks.AbstractQueuedSynchronizer#acquireSharedInterruptibly at line:1304
    java.util.concurrent.CountDownLatch#await at line:231
    org.gradle.api.internal.tasks.testing.worker.TestWorker#execute at line:72
    org.gradle.api.internal.tasks.testing.worker.TestWorker#execute at line:46
    org.gradle.process.internal.worker.child.ActionExecutionWorker#execute at line:86
    org.gradle.process.internal.worker.child.ActionExecutionWorker#execute at line:34
    org.gradle.process.internal.worker.child.SystemApplicationClassLoaderWorker#call at line:132
    org.gradle.process.internal.worker.child.SystemApplicationClassLoaderWorker#call at line:68
    worker.org.gradle.process.internal.worker.GradleWorkerMain#run at line:68
    worker.org.gradle.process.internal.worker.GradleWorkerMain#main at line:73

    Thread[AWT-EventQueue-0,6,main], stackTrace:sun.misc.Unsafe#park
    java.util.concurrent.locks.LockSupport#park at line:175
    java.util.concurrent.locks.AbstractQueuedSynchronizer$ConditionObject#await at line:2039
    java.awt.EventQueue#getNextEvent at line:554
    java.awt.EventDispatchThread#pumpOneEventForFilters at line:170
    java.awt.EventDispatchThread#pumpEventsForFilter at line:116
    java.awt.EventDispatchThread#pumpEventsForHierarchy at line:105
    java.awt.EventDispatchThread#pumpEvents at line:101
    java.awt.EventDispatchThread#pumpEvents at line:93
    java.awt.EventDispatchThread#run at line:82


org.apache.jmeter.testbeans.gui.TestFieldStringEditor > testSetGetAsText STANDARD_OUT
    JMeterUtils.getJMeterVe rsion() = 5.2.0-SNAPSHOT 680367f
    JMeterUtils.getJMeterVe rsion() = 5.2.0-SNAPSHOT 680367f
    JMeterUtils.getJMeterVe rsion() = 5.2.0-SNAPSHOT 680367f

> Task :src:core:check
> Task :src:components:check
> Task :src:components:testJar
> Task :src:functions:compileTestJava
> Task :src:functions:compileTestGroovy
> Task :src:functions:testClasses

> Task :src:protocol:http:compileTestJava
Note: Some input files use or override a deprecated API.
Note: Recompile with -Xlint:deprecation for details.

> Task :src:functions:testJar
> Task :src:protocol:http:compileTestGroovy
> Task :src:protocol:http:testClasses
> Task :src:functions:checkstyleTest
> Task :src:functions:spotbugsTest SKIPPED
> Task :src:protocol:http:testJar

> Task :src:functions:test

org.apache.jmeter.functions.CSVReadFunctionTest STANDARD_OUT
    Setting JMeterHome: F:\jenkins\jenkins-slave\workspace\JMeter Windows\src\functions\..\..\.
    Initializing Properties: ../.././bin/jmeter.properties

org.apache.jmeter.functions.CSVReadFunctionTest STANDARD_ERROR
    Aug 03, 2019 7:08:45 AM java.util.prefs.WindowsPreferences <init>
    WARNING: Could not open/create prefs root node Software\JavaSoft\Prefs at root 0x80000002.
Windows RegCreateKeyEx(...) returned error code 5.

org.apache.jmeter.functions.CSVReadFunctionTest STANDARD_OUT
    JMeterVersion=5.2.0-SNAPSHOT 680367f
    java.version=1.8.0_152
    java.vm.name=Java HotSpot(TM) 64-Bit Server VM
    java.vendor=Oracle Corporation
    java.home=F:\jenkins\tools\java\latest1.8\jre
    file.encoding=windows-1252
    default encoding=windows-1252
    user.home=C:\Users\jenkins
    user.dir=F:\jenkins\jenkins-slave\workspace\JMeter Windows\src\functions
    user.language=en
    user.region=null
    user.country=US
    user.variant=
    Locale=en_US
    java.class.version=52.0
    java.awt.headless=
    os.name=Windows Server 2016
    os.version=10.0
    os.arch=amd64
    java.class.path=F:\jenkins\jenkins-slave\workspace\JMeter Windows\src\functions\build\classes\java\test;F:\jenkins\jenkins-slave\workspace\JMeter
Windows\src\functions\build\classes\groovy\test;F:\jenkins\jenkins-slave\workspace\JMeter
Windows\src\functions\build\resources\test;F:\jenkins\jenkins-slave\workspace\JMeter Windows\src\functions\build\classes\java\main;F:\jenkins\jenkins-slave\workspace\JMeter
Windows\src\functions\build\classes\groovy\main;F:\jenkins\jenkins-slave\workspace\JMeter
Windows\src\functions\build\resources\main;F:\jenkins\jenkins-slave\workspace\JMeter Windows\src\components\build\libs\ApacheJMeter_components.jar;F:\jenkins\jenkins-slave\workspace\JMeter
Windows\src\components\build\libs\ApacheJMeter_components-test.jar;F:\jenkins\jenkins-slave\workspace\JMeter
Windows\src\core\build\libs\ApacheJMeter_core.jar;F:\jenkins\jenkins-slave\workspace\JMeter
Windows\src\core\build\libs\ApacheJMeter_core-test.jar;F:\jenkins\jenkins-slave\workspace\JMeter
Windows\src\jorphan\build\libs\jorphan.jar;F:\jenkins\jenkins-slave\workspace\JMeter Windows\src\jorphan\build\libs\jorphan-test.jar;C:\Users\jenkins\.gradle\caches\modules-2\files-2.1\org.mozilla\rhino\1.7.10\24650bd98b1041df2eb1be5cb64dd1ad5b2e7c55\rhino-1.7.10.jar;C:\Users\jenkins\.gradle\caches\modules-2\files-2.1\org.apache.httpcomponents\httpasyncclient\4.1.4\f3a3240681faae3fa46b573a4c7e50cec9db0d86\httpasyncclient-4.1.4.jar;C:\Users\jenkins\.gradle\caches\modules-2\files-2.1\org.apache.httpcomponents\httpclient\4.5.8\c27c9d6f15435dc2b6947112027b418b0eef32b9\httpclient-4.5.8.jar;C:\Users\jenkins\.gradle\caches\modules-2\files-2.1\commons-codec\commons-codec\1.11\3acb4705652e16236558f0f4f2192cc33c3bd189\commons-codec-1.11.jar;C:\Users\jenkins\.gradle\caches\modules-2\files-2.1\org.apache.commons\commons-jexl\2.1.1\6ecc181debade00230aa1e17666c4ea0371beaaa\commons-jexl-2.1.1.jar;C:\Users\jenkins\.gradle\caches\modules-2\files-2.1\org.apache.commons\commons-jexl3\3.1\a905d9655c30a9b7cfd1d11473b059c72283c888\commons-jexl3-3.1.jar;C:\Users\jenkins\.gradle\caches\modules-2\files-2.1\org.apache.commons\commons-text\1.6\ba72cf0c40cf701e972fe7720ae844629f4ecca2\commons-text-1.6.jar;C:\Users\jenkins\.gradle\caches\modules-2\files-2.1\org.apache.commons\commons-lang3\3.8.1\6505a72a097d9270f7a9e7bf42c4238283247755\commons-lang3-3.8.1.jar;C:\Users\jenkins\.gradle\caches\modules-2\files-2.1\org.apache.xmlgraphics\xmlgraphics-commons\2.3\f0b77d80c4d8f02538512b4d505af0cf5286eb7f\xmlgraphics-commons-2.3.jar;C:\Users\jenkins\.gradle\caches\modules-2\files-2.1\commons-io\commons-io\2.6\815893df5f31da2ece4040fe0a12fd44b577afaf\commons-io-2.6.jar;C:\Users\jenkins\.gradle\caches\modules-2\files-2.1\com.github.ben-manes.caffeine\caffeine\2.6.2\c8fd8817f9d2b2ced82f8968e0dd943aab557de0\caffeine-2.6.2.jar;C:\Users\jenkins\.gradle\caches\modules-2\files-2.1\oro\oro\2.0.8\5592374f834645c4ae250f4c9fbb314c9369d698\oro-2.0.8.jar;C:\Users\jenkins\.gradle\caches\modules-2\files-2.1\org.spockframework\spock-core\1.2-groovy-2.4\799953495449acd81af8670a9bdf60987067fa88\spock-core-1.2-groovy-2.4.jar;C:\Users\jenkins\.gradle\caches\modules-2\files-2.1\junit\junit\4.12\2973d150c0dc1fefe998f834810d68f278ea58ec\junit-4.12.jar;C:\Users\jenkins\.gradle\caches\modules-2\files-2.1\org.exparity\hamcrest-date\2.0.4\c8e8c2812d09229412e04950d455cd43b4771abf\hamcrest-date-2.0.4.jar;C:\Users\jenkins\.gradle\caches\modules-2\files-2.1\org.hamcrest\hamcrest-core\1.3\42a25dc3219429f0e5d060061f71acb49bf010a0\hamcrest-core-1.3.jar;C:\Users\jenkins\.gradle\caches\modules-2\files-2.1\cglib\cglib-nodep\3.2.9\27ca91ebc2b82f844e62a7ba8c2c1fdf9b84fa80\cglib-nodep-3.2.9.jar;C:\Users\jenkins\.gradle\caches\modules-2\files-2.1\org.objenesis\objenesis\2.6\639033469776fd37c08358c6b92a4761feb2af4b\objenesis-2.6.jar;C:\Users\jenkins\.gradle\caches\modules-2\files-2.1\org.apache-extras.beanshell\bsh\2.0b6\fb418f9b33a0b951e9a2978b4b6ee93b2707e72f\bsh-2.0b6.jar;C:\Users\jenkins\.gradle\caches\modules-2\files-2.1\javax.mail\mail\1.5.0-b01\c128515e42609622ce3f7dc0b431026d80bdb688\mail-1.5.0-b01.jar;C:\Users\jenkins\.gradle\caches\modules-2\files-2.1\jcharts\jcharts\0.7.5\496f4515d4eae91a43bde1bc7a965fba500acbbc\jcharts-0.7.5.jar;C:\Users\jenkins\.gradle\caches\modules-2\files-2.1\com.jayway.jsonpath\json-path\2.4.0\765a4401ceb2dc8d40553c2075eb80a8fa35c2ae\json-path-2.4.0.jar;C:\Users\jenkins\.gradle\caches\modules-2\files-2.1\net.minidev\json-smart\2.3\7396407491352ce4fa30de92efb158adb76b5b\json-smart-2.3.jar;C:\Users\jenkins\.gradle\caches\modules-2\files-2.1\net.minidev\accessors-smart\1.2\c592b500269bfde36096641b01238a8350f8aa31\accessors-smart-1.2.jar;C:\Users\jenkins\.gradle\caches\modules-2\files-2.1\org.apache.commons\commons-pool2\2.6.0\df5f4f61183daa8c4c1a9361c7b3ce2b67218eb2\commons-pool2-2.6.0.jar;C:\Users\jenkins\.gradle\caches\modules-2\files-2.1\org.jodd\jodd-lagarto\5.0.6\c3a6ac8cf589b73c0f87de16534ffbb9f397bfc\jodd-lagarto-5.0.6.jar;C:\Users\jenkins\.gradle\caches\modules-2\files-2.1\org.jodd\jodd-log\5.0.6\5af71ee33f67d45c6f2d3965e1d7f069b9100b90\jodd-log-5.0.6.jar;C:\Users\jenkins\.gradle\caches\modules-2\files-2.1\org.apache.httpcomponents\httpcore-nio\4.4.11\7d0a97d01d39cff9aa3e6db81f21fddb2435f4e6\httpcore-nio-4.4.11.jar;C:\Users\jenkins\.gradle\caches\modules-2\files-2.1\org.jsoup\jsoup\1.11.3\36da09a8f68484523fa2aaa100399d612b247d67\jsoup-1.11.3.jar;C:\Users\jenkins\.gradle\caches\modules-2\files-2.1\net.sf.jtidy\jtidy\r938\ab08d87a225a715a69107732b67f21e1da930349\jtidy-r938.jar;C:\Users\jenkins\.gradle\caches\modules-2\files-2.1\commons-collections\commons-collections\3.2.2\8ad72fe39fa8c91eaaf12aadb21e0c3661fe26d5\commons-collections-3.2.2.jar;C:\Users\jenkins\.gradle\caches\modules-2\files-2.1\org.apache.commons\commons-math3\3.6.1\e4ba98f1d4b3c80ec46392f25e094a6a2e58fcbf\commons-math3-3.6.1.jar;C:\Users\jenkins\.gradle\caches\modules-2\files-2.1\com.sun.activation\javax.activation\1.2.0\bf744c1e2776ed1de3c55c8dac1057ec331ef744\javax.activation-1.2.0.jar;C:\Users\jenkins\.gradle\caches\modules-2\files-2.1\bsf\bsf\2.4.0\658f324024bb473c4d15d18b855676fa817353e9\bsf-2.4.0.jar;C:\Users\jenkins\.gradle\caches\modules-2\files-2.1\commons-logging\commons-logging\1.2\4bfc12adfe4842bf07b657f0369c4cb522955686\commons-logging-1.2.jar;F:\jenkins\jenkins-slave\workspace\JMeter
Windows\src\launcher\build\libs\ApacheJMeter.jar;C:\Users\jenkins\.gradle\caches\modules-2\files-2.1\com.fifesoft\rsyntaxtextarea\3.0.2\f72f90937fcd7a1170781ebcedd3f181d37e0d66\rsyntaxtextarea-3.0.2.jar;C:\Users\jenkins\.gradle\caches\modules-2\files-2.1\com.thoughtworks.xstream\xstream\1.4.11\641cc7d58c7d8204f6cbcb4a79f7c3163b4883c2\xstream-1.4.11.jar;C:\Users\jenkins\.gradle\caches\modules-2\files-2.1\org.apache.logging.log4j\log4j-1.2-api\2.11.1\3aba3398fe064a3eab4331f88161c7480e848418\log4j-1.2-api-2.11.1.jar;C:\Users\jenkins\.gradle\caches\modules-2\files-2.1\org.apache.logging.log4j\log4j-slf4j-impl\2.11.1\4b41b53a3a2d299ce381a69d165381ca19f62912\log4j-slf4j-impl-2.11.1.jar;C:\Users\jenkins\.gradle\caches\modules-2\files-2.1\org.apache.logging.log4j\log4j-core\2.11.1\592a48674c926b01a9a747c7831bcd82a9e6d6e4\log4j-core-2.11.1.jar;C:\Users\jenkins\.gradle\caches\modules-2\files-2.1\org.apache.logging.log4j\log4j-api\2.11.1\268f0fe4df3eefe052b57c87ec48517d64fb2a10\log4j-api-2.11.1.jar;C:\Users\jenkins\.gradle\caches\modules-2\files-2.1\xalan\xalan\2.7.2\d55d3f02a56ec4c25695fe67e1334ff8c2ecea23\xalan-2.7.2.jar;C:\Users\jenkins\.gradle\caches\modules-2\files-2.1\net.sf.saxon\Saxon-HE\9.9.1-1\829d62a587108b9d308f153507290e848d242421\Saxon-HE-9.9.1-1.jar;C:\Users\jenkins\.gradle\caches\modules-2\files-2.1\org.slf4j\jcl-over-slf4j\1.7.25\f8c32b13ff142a513eeb5b6330b1588dcb2c0461\jcl-over-slf4j-1.7.25.jar;C:\Users\jenkins\.gradle\caches\modules-2\files-2.1\com.fasterxml.jackson.core\jackson-databind\2.9.9\d6eb9817d9c7289a91f043ac5ee02a6b3cc86238\jackson-databind-2.9.9.jar;C:\Users\jenkins\.gradle\caches\modules-2\files-2.1\com.fasterxml.jackson.core\jackson-annotations\2.9.9\2ea299c145207161c212e28abbc8f513fa245940\jackson-annotations-2.9.9.jar;C:\Users\jenkins\.gradle\caches\modules-2\files-2.1\com.fasterxml.jackson.core\jackson-core\2.9.9\bfff5af9fb8347d26bbb7959cb9b4fe9a2b0ca5e\jackson-core-2.9.9.jar;C:\Users\jenkins\.gradle\caches\modules-2\files-2.1\org.freemarker\freemarker\2.3.28\7200064467a935052f99d114c2c05c3d189bc6d6\freemarker-2.3.28.jar;C:\Users\jenkins\.gradle\caches\modules-2\files-2.1\org.apache.tika\tika-core\1.21\3c297fba4e75b1eeba2ecd6fabb7dbe13dfcb71\tika-core-1.21.jar;C:\Users\jenkins\.gradle\caches\modules-2\files-2.1\org.jodd\jodd-props\5.0.6\78f111d5ddb4d245b4cb5fc3adbd4128835399e\jodd-props-5.0.6.jar;C:\Users\jenkins\.gradle\caches\modules-2\files-2.1\org.jodd\jodd-core\5.0.6\af9ca4122b13708ea581f55654cc31fd688e2b7d\jodd-core-5.0.6.jar;C:\Users\jenkins\.gradle\caches\modules-2\files-2.1\org.codehaus.groovy\groovy-all\2.4.16\aa30a6479a3f6efc2ba8cd810cc2caf22a613b19\groovy-all-2.4.16.jar;C:\Users\jenkins\.gradle\caches\modules-2\files-2.1\org.apache.tika\tika-parsers\1.21\aa9a02883e567c7d550f68ada85024fa37525ef5\tika-parsers-1.21.jar;C:\Users\jenkins\.gradle\caches\modules-2\files-2.1\xerces\xercesImpl\2.12.0\f02c844149fd306601f20e0b34853a670bef7fa2\xercesImpl-2.12.0.jar;C:\Users\jenkins\.gradle\caches\modules-2\files-2.1\xalan\serializer\2.7.2\24247f3bb052ee068971393bdb83e04512bb1c3c\serializer-2.7.2.jar;C:\Users\jenkins\.gradle\caches\modules-2\files-2.1\xml-apis\xml-apis\1.4.01\3789d9fada2d3d458c4ba2de349d48780f381ee3\xml-apis-1.4.01.jar;C:\Users\jenkins\.gradle\caches\modules-2\files-2.1\org.slf4j\slf4j-api\1.7.25\da76ca59f6a57ee3102f8f9bd9cee742973efa8a\slf4j-api-1.7.25.jar;C:\Users\jenkins\.gradle\caches\modules-2\files-2.1\org.apache.httpcomponents\httpcore\4.4.11\de748cf874e4e193b42eceea9fe5574fabb9d4df\httpcore-4.4.11.jar;C:\Users\jenkins\.gradle\caches\modules-2\files-2.1\xmlpull\xmlpull\1.1.3.1\2b8e230d2ab644e4ecaa94db7cdedbc40c805dfa\xmlpull-1.1.3.1.jar;C:\Users\jenkins\.gradle\caches\modules-2\files-2.1\xpp3\xpp3_min\1.1.4c\19d4e90b43059058f6e056f794f0ea4030d60b86\xpp3_min-1.1.4c.jar;C:\Users\jenkins\.gradle\caches\modules-2\files-2.1\org.ow2.asm\asm\7.1\fa29aa438674ff19d5e1386d2c3527a0267f291e\asm-7.1.jar

> Task :src:protocol:http:checkstyleTest
> Task :src:protocol:http:spotbugsTest SKIPPED

> Task :src:protocol:http:test

org.apache.jmeter.gui.action.ParseCurlCommandActionTest > testCreateCookieManager STANDARD_ERROR
    Aug 03, 2019 7:08:47 AM java.util.prefs.WindowsPreferences <init>
    WARNING: Could not open/create prefs root node Software\JavaSoft\Prefs at root 0x80000002.
Windows RegCreateKeyEx(...) returned error code 5.

> Task :src:dist-check:compileTestJava
> Task :src:dist-check:compileTestGroovy
> Task :src:dist-check:testClasses

> Task :src:protocol:http:test

org.apache.jmeter.protocol.http.config.UrlConfigTest STANDARD_OUT
    Setting JMeterHome: F:\jenkins\jenkins-slave\workspace\JMeter Windows\src\protocol\http\..\..\..\.
    Initializing Properties: ../../.././bin/jmeter.properties
    JMeterVersion=5.2.0-SNAPSHOT 680367f
    java.version=1.8.0_152
    java.vm.name=Java HotSpot(TM) 64-Bit Server VM
    java.vendor=Oracle Corporation
    java.home=F:\jenkins\tools\java\latest1.8\jre
    file.encoding=windows-1252
    default encoding=windows-1252
    user.home=C:\Users\jenkins
    user.dir=F:\jenkins\jenkins-slave\workspace\JMeter Windows\src\protocol\http
    user.language=en
    user.region=null
    user.country=US
    user.variant=
    Locale=en_US
    java.class.version=52.0
    java.awt.headless=
    os.name=Windows Server 2016
    os.version=10.0
    os.arch=amd64
    java.class.path=F:\jenkins\jenkins-slave\workspace\JMeter Windows\src\protocol\http\build\classes\java\test;F:\jenkins\jenkins-slave\workspace\JMeter
Windows\src\protocol\http\build\classes\groovy\test;F:\jenkins\jenkins-slave\workspace\JMeter
Windows\src\protocol\http\build\resources\test;F:\jenkins\jenkins-slave\workspace\JMeter Windows\src\protocol\http\build\classes\java\main;F:\jenkins\jenkins-slave\workspace\JMeter
Windows\src\protocol\http\build\classes\groovy\main;F:\jenkins\jenkins-slave\workspace\JMeter
Windows\src\protocol\http\build\resources\main;F:\jenkins\jenkins-slave\workspace\JMeter Windows\src\components\build\libs\ApacheJMeter_components.jar;F:\jenkins\jenkins-slave\workspace\JMeter
Windows\src\components\build\libs\ApacheJMeter_components-test.jar;F:\jenkins\jenkins-slave\workspace\JMeter
Windows\src\core\build\libs\ApacheJMeter_core.jar;F:\jenkins\jenkins-slave\workspace\JMeter
Windows\src\core\build\libs\ApacheJMeter_core-test.jar;F:\jenkins\jenkins-slave\workspace\JMeter
Windows\src\jorphan\build\libs\jorphan.jar;F:\jenkins\jenkins-slave\workspace\JMeter Windows\src\jorphan\build\libs\jorphan-test.jar;C:\Users\jenkins\.gradle\caches\modules-2\files-2.1\com.thoughtworks.xstream\xstream\1.4.11\641cc7d58c7d8204f6cbcb4a79f7c3163b4883c2\xstream-1.4.11.jar;C:\Users\jenkins\.gradle\caches\modules-2\files-2.1\com.github.ben-manes.caffeine\caffeine\2.6.2\c8fd8817f9d2b2ced82f8968e0dd943aab557de0\caffeine-2.6.2.jar;C:\Users\jenkins\.gradle\caches\modules-2\files-2.1\org.apache.xmlgraphics\xmlgraphics-commons\2.3\f0b77d80c4d8f02538512b4d505af0cf5286eb7f\xmlgraphics-commons-2.3.jar;C:\Users\jenkins\.gradle\caches\modules-2\files-2.1\commons-io\commons-io\2.6\815893df5f31da2ece4040fe0a12fd44b577afaf\commons-io-2.6.jar;C:\Users\jenkins\.gradle\caches\modules-2\files-2.1\org.apache.commons\commons-text\1.6\ba72cf0c40cf701e972fe7720ae844629f4ecca2\commons-text-1.6.jar;C:\Users\jenkins\.gradle\caches\modules-2\files-2.1\org.apache.commons\commons-lang3\3.8.1\6505a72a097d9270f7a9e7bf42c4238283247755\commons-lang3-3.8.1.jar;C:\Users\jenkins\.gradle\caches\modules-2\files-2.1\org.jodd\jodd-lagarto\5.0.6\c3a6ac8cf589b73c0f87de16534ffbb9f397bfc\jodd-lagarto-5.0.6.jar;C:\Users\jenkins\.gradle\caches\modules-2\files-2.1\org.jsoup\jsoup\1.11.3\36da09a8f68484523fa2aaa100399d612b247d67\jsoup-1.11.3.jar;C:\Users\jenkins\.gradle\caches\modules-2\files-2.1\oro\oro\2.0.8\5592374f834645c4ae250f4c9fbb314c9369d698\oro-2.0.8.jar;C:\Users\jenkins\.gradle\caches\modules-2\files-2.1\commons-collections\commons-collections\3.2.2\8ad72fe39fa8c91eaaf12aadb21e0c3661fe26d5\commons-collections-3.2.2.jar;C:\Users\jenkins\.gradle\caches\modules-2\files-2.1\commons-net\commons-net\3.6\b71de00508dcb078d2b24b5fa7e538636de9b3da\commons-net-3.6.jar;C:\Users\jenkins\.gradle\caches\modules-2\files-2.1\com.helger\ph-css\6.1.1\917191de545d933eb813679d0cccac40ffe0c102\ph-css-6.1.1.jar;C:\Users\jenkins\.gradle\caches\modules-2\files-2.1\com.helger\ph-commons\9.2.1\4ef90c81f5e1314aa8f3a0ab260d9ad375462501\ph-commons-9.2.1.jar;C:\Users\jenkins\.gradle\caches\modules-2\files-2.1\dnsjava\dnsjava\2.1.8\eed8a2cbf56cc60d07a189a429ead3067564193c\dnsjava-2.1.8.jar;C:\Users\jenkins\.gradle\caches\modules-2\files-2.1\org.apache.httpcomponents\httpmime\4.5.8\f5bd81aa5b2d091398199e6ee234bf7094889f1d\httpmime-4.5.8.jar;C:\Users\jenkins\.gradle\caches\modules-2\files-2.1\org.brotli\dec\0.1.2\c26a897ae0d524809eef1c786cc6183b4ddcc3b\dec-0.1.2.jar;C:\Users\jenkins\.gradle\caches\modules-2\files-2.1\org.spockframework\spock-core\1.2-groovy-2.4\799953495449acd81af8670a9bdf60987067fa88\spock-core-1.2-groovy-2.4.jar;C:\Users\jenkins\.gradle\caches\modules-2\files-2.1\junit\junit\4.12\2973d150c0dc1fefe998f834810d68f278ea58ec\junit-4.12.jar;C:\Users\jenkins\.gradle\caches\modules-2\files-2.1\cglib\cglib-nodep\3.2.9\27ca91ebc2b82f844e62a7ba8c2c1fdf9b84fa80\cglib-nodep-3.2.9.jar;C:\Users\jenkins\.gradle\caches\modules-2\files-2.1\org.objenesis\objenesis\2.6\639033469776fd37c08358c6b92a4761feb2af4b\objenesis-2.6.jar;F:\jenkins\jenkins-slave\workspace\JMeter
Windows\src\launcher\build\libs\ApacheJMeter.jar;C:\Users\jenkins\.gradle\caches\modules-2\files-2.1\bsf\bsf\2.4.0\658f324024bb473c4d15d18b855676fa817353e9\bsf-2.4.0.jar;C:\Users\jenkins\.gradle\caches\modules-2\files-2.1\com.fifesoft\rsyntaxtextarea\3.0.2\f72f90937fcd7a1170781ebcedd3f181d37e0d66\rsyntaxtextarea-3.0.2.jar;C:\Users\jenkins\.gradle\caches\modules-2\files-2.1\net.sf.jtidy\jtidy\r938\ab08d87a225a715a69107732b67f21e1da930349\jtidy-r938.jar;C:\Users\jenkins\.gradle\caches\modules-2\files-2.1\org.apache.logging.log4j\log4j-1.2-api\2.11.1\3aba3398fe064a3eab4331f88161c7480e848418\log4j-1.2-api-2.11.1.jar;C:\Users\jenkins\.gradle\caches\modules-2\files-2.1\org.apache.logging.log4j\log4j-slf4j-impl\2.11.1\4b41b53a3a2d299ce381a69d165381ca19f62912\log4j-slf4j-impl-2.11.1.jar;C:\Users\jenkins\.gradle\caches\modules-2\files-2.1\org.apache.logging.log4j\log4j-core\2.11.1\592a48674c926b01a9a747c7831bcd82a9e6d6e4\log4j-core-2.11.1.jar;C:\Users\jenkins\.gradle\caches\modules-2\files-2.1\org.apache.logging.log4j\log4j-api\2.11.1\268f0fe4df3eefe052b57c87ec48517d64fb2a10\log4j-api-2.11.1.jar;C:\Users\jenkins\.gradle\caches\modules-2\files-2.1\xalan\xalan\2.7.2\d55d3f02a56ec4c25695fe67e1334ff8c2ecea23\xalan-2.7.2.jar;C:\Users\jenkins\.gradle\caches\modules-2\files-2.1\net.sf.saxon\Saxon-HE\9.9.1-1\829d62a587108b9d308f153507290e848d242421\Saxon-HE-9.9.1-1.jar;C:\Users\jenkins\.gradle\caches\modules-2\files-2.1\org.slf4j\jcl-over-slf4j\1.7.25\f8c32b13ff142a513eeb5b6330b1588dcb2c0461\jcl-over-slf4j-1.7.25.jar;C:\Users\jenkins\.gradle\caches\modules-2\files-2.1\org.apache.httpcomponents\httpasyncclient\4.1.4\f3a3240681faae3fa46b573a4c7e50cec9db0d86\httpasyncclient-4.1.4.jar;C:\Users\jenkins\.gradle\caches\modules-2\files-2.1\org.apache.httpcomponents\httpclient\4.5.8\c27c9d6f15435dc2b6947112027b418b0eef32b9\httpclient-4.5.8.jar;C:\Users\jenkins\.gradle\caches\modules-2\files-2.1\commons-codec\commons-codec\1.11\3acb4705652e16236558f0f4f2192cc33c3bd189\commons-codec-1.11.jar;C:\Users\jenkins\.gradle\caches\modules-2\files-2.1\com.fasterxml.jackson.core\jackson-databind\2.9.9\d6eb9817d9c7289a91f043ac5ee02a6b3cc86238\jackson-databind-2.9.9.jar;C:\Users\jenkins\.gradle\caches\modules-2\files-2.1\com.fasterxml.jackson.core\jackson-annotations\2.9.9\2ea299c145207161c212e28abbc8f513fa245940\jackson-annotations-2.9.9.jar;C:\Users\jenkins\.gradle\caches\modules-2\files-2.1\com.fasterxml.jackson.core\jackson-core\2.9.9\bfff5af9fb8347d26bbb7959cb9b4fe9a2b0ca5e\jackson-core-2.9.9.jar;C:\Users\jenkins\.gradle\caches\modules-2\files-2.1\org.freemarker\freemarker\2.3.28\7200064467a935052f99d114c2c05c3d189bc6d6\freemarker-2.3.28.jar;C:\Users\jenkins\.gradle\caches\modules-2\files-2.1\org.mozilla\rhino\1.7.10\24650bd98b1041df2eb1be5cb64dd1ad5b2e7c55\rhino-1.7.10.jar;C:\Users\jenkins\.gradle\caches\modules-2\files-2.1\org.apache.commons\commons-math3\3.6.1\e4ba98f1d4b3c80ec46392f25e094a6a2e58fcbf\commons-math3-3.6.1.jar;C:\Users\jenkins\.gradle\caches\modules-2\files-2.1\org.apache.tika\tika-core\1.21\3c297fba4e75b1eeba2ecd6fabb7dbe13dfcb71\tika-core-1.21.jar;C:\Users\jenkins\.gradle\caches\modules-2\files-2.1\org.jodd\jodd-props\5.0.6\78f111d5ddb4d245b4cb5fc3adbd4128835399e\jodd-props-5.0.6.jar;C:\Users\jenkins\.gradle\caches\modules-2\files-2.1\org.jodd\jodd-core\5.0.6\af9ca4122b13708ea581f55654cc31fd688e2b7d\jodd-core-5.0.6.jar;C:\Users\jenkins\.gradle\caches\modules-2\files-2.1\org.codehaus.groovy\groovy-all\2.4.16\aa30a6479a3f6efc2ba8cd810cc2caf22a613b19\groovy-all-2.4.16.jar;C:\Users\jenkins\.gradle\caches\modules-2\files-2.1\org.apache.tika\tika-parsers\1.21\aa9a02883e567c7d550f68ada85024fa37525ef5\tika-parsers-1.21.jar;C:\Users\jenkins\.gradle\caches\modules-2\files-2.1\xerces\xercesImpl\2.12.0\f02c844149fd306601f20e0b34853a670bef7fa2\xercesImpl-2.12.0.jar;C:\Users\jenkins\.gradle\caches\modules-2\files-2.1\xalan\serializer\2.7.2\24247f3bb052ee068971393bdb83e04512bb1c3c\serializer-2.7.2.jar;C:\Users\jenkins\.gradle\caches\modules-2\files-2.1\xml-apis\xml-apis\1.4.01\3789d9fada2d3d458c4ba2de349d48780f381ee3\xml-apis-1.4.01.jar;C:\Users\jenkins\.gradle\caches\modules-2\files-2.1\org.apache-extras.beanshell\bsh\2.0b6\fb418f9b33a0b951e9a2978b4b6ee93b2707e72f\bsh-2.0b6.jar;C:\Users\jenkins\.gradle\caches\modules-2\files-2.1\javax.mail\mail\1.5.0-b01\c128515e42609622ce3f7dc0b431026d80bdb688\mail-1.5.0-b01.jar;C:\Users\jenkins\.gradle\caches\modules-2\files-2.1\jcharts\jcharts\0.7.5\496f4515d4eae91a43bde1bc7a965fba500acbbc\jcharts-0.7.5.jar;C:\Users\jenkins\.gradle\caches\modules-2\files-2.1\com.jayway.jsonpath\json-path\2.4.0\765a4401ceb2dc8d40553c2075eb80a8fa35c2ae\json-path-2.4.0.jar;C:\Users\jenkins\.gradle\caches\modules-2\files-2.1\net.minidev\json-smart\2.3\7396407491352ce4fa30de92efb158adb76b5b\json-smart-2.3.jar;C:\Users\jenkins\.gradle\caches\modules-2\files-2.1\net.minidev\accessors-smart\1.2\c592b500269bfde36096641b01238a8350f8aa31\accessors-smart-1.2.jar;C:\Users\jenkins\.gradle\caches\modules-2\files-2.1\org.apache.commons\commons-pool2\2.6.0\df5f4f61183daa8c4c1a9361c7b3ce2b67218eb2\commons-pool2-2.6.0.jar;C:\Users\jenkins\.gradle\caches\modules-2\files-2.1\org.jodd\jodd-log\5.0.6\5af71ee33f67d45c6f2d3965e1d7f069b9100b90\jodd-log-5.0.6.jar;C:\Users\jenkins\.gradle\caches\modules-2\files-2.1\org.apache.httpcomponents\httpcore-nio\4.4.11\7d0a97d01d39cff9aa3e6db81f21fddb2435f4e6\httpcore-nio-4.4.11.jar;C:\Users\jenkins\.gradle\caches\modules-2\files-2.1\com.sun.activation\javax.activation\1.2.0\bf744c1e2776ed1de3c55c8dac1057ec331ef744\javax.activation-1.2.0.jar;C:\Users\jenkins\.gradle\caches\modules-2\files-2.1\org.slf4j\slf4j-api\1.7.25\da76ca59f6a57ee3102f8f9bd9cee742973efa8a\slf4j-api-1.7.25.jar;C:\Users\jenkins\.gradle\caches\modules-2\files-2.1\org.apache.httpcomponents\httpcore\4.4.11\de748cf874e4e193b42eceea9fe5574fabb9d4df\httpcore-4.4.11.jar;C:\Users\jenkins\.gradle\caches\modules-2\files-2.1\commons-logging\commons-logging\1.2\4bfc12adfe4842bf07b657f0369c4cb522955686\commons-logging-1.2.jar;C:\Users\jenkins\.gradle\caches\modules-2\files-2.1\org.hamcrest\hamcrest-core\1.3\42a25dc3219429f0e5d060061f71acb49bf010a0\hamcrest-core-1.3.jar;C:\Users\jenkins\.gradle\caches\modules-2\files-2.1\xmlpull\xmlpull\1.1.3.1\2b8e230d2ab644e4ecaa94db7cdedbc40c805dfa\xmlpull-1.1.3.1.jar;C:\Users\jenkins\.gradle\caches\modules-2\files-2.1\xpp3\xpp3_min\1.1.4c\19d4e90b43059058f6e056f794f0ea4030d60b86\xpp3_min-1.1.4c.jar;C:\Users\jenkins\.gradle\caches\modules-2\files-2.1\org.ow2.asm\asm\7.1\fa29aa438674ff19d5e1386d2c3527a0267f291e\asm-7.1.jar

> Task :src:dist-check:checkstyleTest
> Task :src:dist-check:spotbugsTest SKIPPED
> Task :src:functions:check
> Task :src:dist:copyLibs
> Task :src:dist:compileTestJava NO-SOURCE
> Task :src:dist:testClasses UP-TO-DATE
> Task :src:dist:checkstyleTest NO-SOURCE
> Task :src:dist:spotbugsTest SKIPPED
> Task :src:dist:test NO-SOURCE
> Task :src:dist:check UP-TO-DATE
> Task :src:dist:createDist
> Task :src:dist-check:copyExtraTestLibs

> Task :src:dist-check:batchBUG_62847
Aug 03, 2019 7:08:58 AM java.util.prefs.WindowsPreferences <init>
WARNING: Could not open/create prefs root node Software\JavaSoft\Prefs at root 0x80000002.
Windows RegCreateKeyEx(...) returned error code 5.
Creating summariser <summary>
Created the tree successfully using F:\jenkins\jenkins-slave\workspace\JMeter Windows\bin\testfiles\BUG_62847.jmx
Starting the test @ Sat Aug 03 07:08:58 PDT 2019 (1564841338165)
Waiting for possible Shutdown/StopTestNow/HeapDump/ThreadDump message on port 4445
summary =      6 in 00:00:00 =   15.3/s Avg:     0 Min:     0 Max:     2 Err:     0 (0.00%)
Tidying up ...    @ Sat Aug 03 07:08:58 PDT 2019 (1564841338760)
... end of run
No errors present in the logfile F:\jenkins\jenkins-slave\workspace\JMeter Windows\bin\BUG_62847.log
(the file is empty)

> Task :src:dist-check:batchBatchTestLocal
Aug 03, 2019 7:09:01 AM java.util.prefs.WindowsPreferences <init>
WARNING: Could not open/create prefs root node Software\JavaSoft\Prefs at root 0x80000002.
Windows RegCreateKeyEx(...) returned error code 5.
Creating summariser <summary>
Created the tree successfully using F:\jenkins\jenkins-slave\workspace\JMeter Windows\bin\testfiles\BatchTestLocal.jmx
Starting the test @ Sat Aug 03 07:09:01 PDT 2019 (1564841341239)
Waiting for possible Shutdown/StopTestNow/HeapDump/ThreadDump message on port 4445
summary +      1 in 00:00:00 =    5.3/s Avg:   149 Min:   149 Max:   149 Err:     0 (0.00%)
Active: 1 Started: 1 Finished: 0

> Task :src:protocol:http:test

org.apache.jmeter.protocol.http.parser.TestHTMLParser > testParserSet STANDARD_OUT
    F:\jenkins\jenkins-slave\workspace\JMeter Windows\src\protocol\http\..\..\..\bin\testfiles\HTMLParserTestFile_2.html
    F:\jenkins\jenkins-slave\workspace\JMeter Windows\src\protocol\http\..\..\..\bin\testfiles\HTMLParserTestFile_2.all

org.apache.jmeter.protocol.http.parser.TestHTMLParser > testParserList STANDARD_OUT
    F:\jenkins\jenkins-slave\workspace\JMeter Windows\src\protocol\http\..\..\..\bin\testfiles\HTMLParserTestFile_2.html
    F:\jenkins\jenkins-slave\workspace\JMeter Windows\src\protocol\http\..\..\..\bin\testfiles\HTMLParserTestFile_2.all

org.apache.jmeter.protocol.http.parser.TestHTMLParser > testParserSet STANDARD_OUT
    F:\jenkins\jenkins-slave\workspace\JMeter Windows\src\protocol\http\..\..\..\bin\testfiles\HTMLParserTestFile_2.html
    F:\jenkins\jenkins-slave\workspace\JMeter Windows\src\protocol\http\..\..\..\bin\testfiles\HTMLParserTestFile_2.all

org.apache.jmeter.protocol.http.parser.TestHTMLParser > testParserList STANDARD_OUT
    F:\jenkins\jenkins-slave\workspace\JMeter Windows\src\protocol\http\..\..\..\bin\testfiles\HTMLParserTestFile_2.html
    F:\jenkins\jenkins-slave\workspace\JMeter Windows\src\protocol\http\..\..\..\bin\testfiles\HTMLParserTestFile_2.all

org.apache.jmeter.protocol.http.parser.TestHTMLParser > testParserSet STANDARD_OUT
    F:\jenkins\jenkins-slave\workspace\JMeter Windows\src\protocol\http\..\..\..\bin\testfiles\HTMLParserTestFile_2.html
    F:\jenkins\jenkins-slave\workspace\JMeter Windows\src\protocol\http\..\..\..\bin\testfiles\HTMLParserTestFile_2.all

org.apache.jmeter.protocol.http.parser.TestHTMLParser > testParserList STANDARD_OUT
    F:\jenkins\jenkins-slave\workspace\JMeter Windows\src\protocol\http\..\..\..\bin\testfiles\HTMLParserTestFile_2.html
    F:\jenkins\jenkins-slave\workspace\JMeter Windows\src\protocol\http\..\..\..\bin\testfiles\HTMLParserTestFile_2.all

org.apache.jmeter.protocol.http.parser.TestHTMLParser > testParserSet STANDARD_OUT
    F:\jenkins\jenkins-slave\workspace\JMeter Windows\src\protocol\http\..\..\..\bin\testfiles\HTMLParserTestFile_2.html
    F:\jenkins\jenkins-slave\workspace\JMeter Windows\src\protocol\http\..\..\..\bin\testfiles\HTMLParserTestFile_2.all

org.apache.jmeter.protocol.http.parser.TestHTMLParser > testParserList STANDARD_OUT
    F:\jenkins\jenkins-slave\workspace\JMeter Windows\src\protocol\http\..\..\..\bin\testfiles\HTMLParserTestFile_2.html
    F:\jenkins\jenkins-slave\workspace\JMeter Windows\src\protocol\http\..\..\..\bin\testfiles\HTMLParserTestFile_2.all

org.apache.jmeter.protocol.http.sampler.SamplingNamingTest > testBug63364[Run 0: implementation:HttpClient4]
FAILED
    java.lang.AssertionError: We should have at least one sample result, we had none
        at org.junit.Assert.fail(Assert.java:88)
        at org.junit.Assert.assertTrue(Assert.java:41)
        at org.apache.jmeter.protocol.http.sampler.SamplingNamingTest.testBug63364(SamplingNamingTest.java:55)

org.apache.jmeter.protocol.http.sampler.SamplingNamingTest > testBug63364[Run 1: implementation:Java]
FAILED
    java.lang.AssertionError: We should have at least one sample result, we had none
        at org.junit.Assert.fail(Assert.java:88)
        at org.junit.Assert.assertTrue(Assert.java:41)
        at org.apache.jmeter.protocol.http.sampler.SamplingNamingTest.testBug63364(SamplingNamingTest.java:55)

596 tests completed, 2 failed

> Task :src:protocol:http:test FAILED

> Task :src:dist-check:batchBatchTestLocal
summary +    132 in 00:00:49 =    2.7/s Avg:   118 Min:     1 Max:   248 Err:    16 (12.12%)
Active: 0 Started: 1 Finished: 1
summary =    133 in 00:00:50 =    2.7/s Avg:   118 Min:     1 Max:   248 Err:    16 (12.03%)
Tidying up ...    @ Sat Aug 03 07:09:51 PDT 2019 (1564841391303)
... end of run
No errors present in the logfile F:\jenkins\jenkins-slave\workspace\JMeter Windows\bin\BatchTestLocal.log
(the file is empty)

FAILURE: Build failed with an exception.

* What went wrong:
Execution failed for task ':src:protocol:http:test'.
> There were failing tests. See the report at: file:///F:/jenkins/jenkins-slave/workspace/JMeter%20Windows/src/protocol/http/build/reports/tests/test/index.html

* Try:
Run with --stacktrace option to get the stack trace. Run with --info or --debug option to
get more log output. Run with --scan to get full insights.

* Get more help at https://help.gradle.org

Deprecated Gradle features were used in this build, making it incompatible with Gradle 6.0.
Use '--warning-mode all' to show the individual deprecation warnings.
See https://docs.gradle.org/5.5.1/userguide/command_line_interface.html#sec:command_line_warnings

BUILD FAILED in 3m 12s
156 actionable tasks: 82 executed, 74 up-to-date
Could not open/create prefs root node Software\JavaSoft\Prefs at root 0x80000002. Windows
RegCreateKeyEx(...) returned error code 5.
Build step 'Invoke Gradle script' changed build result to FAILURE
Build step 'Invoke Gradle script' marked build as failure

Mime
View raw message