jmeter-dev mailing list archives

Site index · List index
Message view « Date » · « Thread »
Top « Date » · « Thread »
From Apache Jenkins Server <jenk...@builds.apache.org>
Subject Build failed in Jenkins: JMeter-trunk #7286
Date Sat, 03 Aug 2019 15:08:59 GMT
See <https://builds.apache.org/job/JMeter-trunk/7286/display/redirect>

------------------------------------------
[...truncated 45.79 KB...]
> Task :src:protocol:mail:classes UP-TO-DATE
> Task :src:protocol:junit-sample:classes UP-TO-DATE
> Task :src:protocol:jdbc:compileJava UP-TO-DATE
> Task :src:protocol:java:compileJava UP-TO-DATE
> Task :src:protocol:junit:compileJava UP-TO-DATE
> Task :src:protocol:native:compileJava UP-TO-DATE
> Task :src:protocol:native:classes UP-TO-DATE
> Task :src:protocol:mongodb:compileJava UP-TO-DATE
> Task :src:protocol:java:classes UP-TO-DATE
> Task :src:protocol:mongodb:classes UP-TO-DATE
> Task :src:protocol:junit:classes UP-TO-DATE
> Task :src:protocol:jdbc:compileGroovy NO-SOURCE
> Task :src:protocol:jdbc:classes UP-TO-DATE
> Task :src:protocol:jms:compileJava UP-TO-DATE
> Task :src:protocol:jms:classes UP-TO-DATE
> Task :src:protocol:jdbc:jar UP-TO-DATE
> Task :src:protocol:ftp:compileJava UP-TO-DATE
> Task :src:protocol:junit-sample:jar UP-TO-DATE
> Task :src:protocol:ldap:compileJava UP-TO-DATE
> Task :src:protocol:tcp:compileJava UP-TO-DATE
> Task :src:protocol:ldap:classes UP-TO-DATE
> Task :src:protocol:tcp:classes UP-TO-DATE
> Task :src:protocol:ftp:classes UP-TO-DATE
> Task :src:protocol:mail:jar UP-TO-DATE
> Task :src:protocol:mongodb:jar UP-TO-DATE
> Task :src:protocol:jms:jar UP-TO-DATE
> Task :src:protocol:junit:jar UP-TO-DATE
> Task :src:protocol:ldap:jar UP-TO-DATE
> Task :src:protocol:ftp:jar UP-TO-DATE
> Task :src:protocol:native:jar UP-TO-DATE
> Task :src:protocol:java:jar UP-TO-DATE
> Task :src:protocol:tcp:jar UP-TO-DATE
> Task :rat UP-TO-DATE
> Task :spotbugsMain NO-SOURCE
> Task :spotbugsTest NO-SOURCE
> Task :test NO-SOURCE
> Task :check UP-TO-DATE
> Task :jar UP-TO-DATE
> Task :assemble UP-TO-DATE
> Task :src:dist:distTarSource UP-TO-DATE
> Task :src:components:compileJava UP-TO-DATE
> Task :src:components:compileGroovy NO-SOURCE
> Task :src:components:classes UP-TO-DATE
> Task :src:core:jar
> Task :src:generator:compileJava UP-TO-DATE
> Task :src:generator:classes UP-TO-DATE
> Task :src:generator:jar UP-TO-DATE
> Task :src:examples:compileJava UP-TO-DATE
> Task :src:examples:classes UP-TO-DATE
> Task :src:functions:compileJava UP-TO-DATE
> Task :src:functions:compileGroovy NO-SOURCE
> Task :src:functions:classes UP-TO-DATE
> Task :src:functions:jar UP-TO-DATE
> Task :src:dist:distTarSourceSha512
> Task :src:generator:checkstyleMain
> Task :src:protocol:native:checkstyleMain
> Task :src:jorphan:checkstyleTest
> Task :src:protocol:jdbc:checkstyleMain
> Task :src:protocol:junit-sample:checkstyleMain
> Task :src:protocol:java:checkstyleMain
> Task :src:protocol:tcp:checkstyleMain
> Task :src:protocol:mongodb:checkstyleMain
> Task :src:protocol:mail:checkstyleMain
> Task :src:protocol:junit:checkstyleMain
> Task :src:examples:checkstyleMain
> Task :src:protocol:ftp:checkstyleMain
> Task :src:protocol:ldap:checkstyleMain
> Task :src:generator:compileTestJava NO-SOURCE
> Task :src:examples:compileTestJava NO-SOURCE
> Task :src:generator:testClasses UP-TO-DATE
> Task :src:examples:testClasses UP-TO-DATE
> Task :src:generator:checkstyleTest NO-SOURCE
> Task :src:generator:assemble UP-TO-DATE
> Task :src:examples:checkstyleTest NO-SOURCE
> Task :src:examples:jar
> Task :src:examples:assemble
> Task :src:functions:checkstyleMain
> Task :src:functions:assemble UP-TO-DATE
> Task :src:protocol:jms:checkstyleMain
> Task :src:bshclient:spotbugsMain FAILED

> Task :src:core:compileTestJava
Note: <https://builds.apache.org/job/JMeter-trunk/ws/src/core/src/test/java/org/apache/jmeter/listeners/TestResultAction.java>
uses or overrides a deprecated API.
Note: Recompile with -Xlint:deprecation for details.

> Task :src:components:checkstyleMain

> Task :src:protocol:http:compileJava
Note: Some input files use or override a deprecated API.
Note: Recompile with -Xlint:deprecation for details.
Note: <https://builds.apache.org/job/JMeter-trunk/ws/src/protocol/http/src/main/java/org/apache/jmeter/protocol/http/sampler/HTTPHC4Impl.java>
uses unchecked or unsafe operations.
Note: Recompile with -Xlint:unchecked for details.

> Task :src:protocol:junit-sample:spotbugsMain FAILED
> Task :src:dist:distZipSource
> Task :src:protocol:jdbc:spotbugsMain
> Task :src:protocol:java:spotbugsMain
> Task :src:jorphan:spotbugsMain
> Task :src:protocol:native:spotbugsMain
> Task :src:protocol:mongodb:spotbugsMain
> Task :src:protocol:tcp:spotbugsMain
> Task :src:protocol:mail:spotbugsMain
> Task :src:protocol:junit:spotbugsMain
> Task :src:protocol:ftp:spotbugsMain
> Task :src:protocol:ldap:spotbugsMain
> Task :src:protocol:jms:spotbugsMain
> Task :src:protocol:mongodb:spotbugsMain FAILED
> Task :src:protocol:jdbc:spotbugsMain FAILED
> Task :src:protocol:ftp:spotbugsMain FAILED
> Task :src:protocol:native:spotbugsMain FAILED
> Task :src:protocol:junit:spotbugsMain FAILED
> Task :src:protocol:tcp:spotbugsMain FAILED
> Task :src:protocol:mail:spotbugsMain FAILED
> Task :src:protocol:jms:spotbugsMain FAILED
> Task :src:jorphan:spotbugsMain FAILED

FAILURE: Build completed with 11 failures.

1: Task failed with an exception.
-----------
* What went wrong:
Execution failed for task ':src:bshclient:spotbugsMain'.
> SpotBugs rule violations were found. See the report at: file://<https://builds.apache.org/job/JMeter-trunk/ws/src/bshclient/build/reports/spotbugs/main.xml>

* Try:
Run with --stacktrace option to get the stack trace. Run with --info or --debug option to
get more log output. Run with --scan to get full insights.
==============================================================================

2: Task failed with an exception.
-----------
* What went wrong:
Execution failed for task ':src:protocol:junit-sample:spotbugsMain'.
> SpotBugs rule violations were found. See the report at: file://<https://builds.apache.org/job/JMeter-trunk/ws/src/protocol/junit-sample/build/reports/spotbugs/main.xml>

* Try:
Run with --stacktrace option to get the stack trace. Run with --info or --debug option to
get more log output. Run with --scan to get full insights.
==============================================================================

3: Task failed with an exception.
-----------
* What went wrong:
Execution failed for task ':src:protocol:mongodb:spotbugsMain'.
> SpotBugs rule violations were found. See the report at: file://<https://builds.apache.org/job/JMeter-trunk/ws/src/protocol/mongodb/build/reports/spotbugs/main.xml>

* Try:
Run with --stacktrace option to get the stack trace. Run with --info or --debug option to
get more log output. Run with --scan to get full insights.
==============================================================================

4: Task failed with an exception.
-----------
* What went wrong:
Execution failed for task ':src:protocol:jdbc:spotbugsMain'.
> SpotBugs rule violations were found. See the report at: file://<https://builds.apache.org/job/JMeter-trunk/ws/src/protocol/jdbc/build/reports/spotbugs/main.xml>

* Try:
Run with --stacktrace option to get the stack trace. Run with --info or --debug option to
get more log output. Run with --scan to get full insights.
==============================================================================

5: Task failed with an exception.
-----------
* What went wrong:
Execution failed for task ':src:protocol:ftp:spotbugsMain'.
> SpotBugs rule violations were found. See the report at: file://<https://builds.apache.org/job/JMeter-trunk/ws/src/protocol/ftp/build/reports/spotbugs/main.xml>

* Try:
Run with --stacktrace option to get the stack trace. Run with --info or --debug option to
get more log output. Run with --scan to get full insights.
==============================================================================

6: Task failed with an exception.
-----------
* What went wrong:
Execution failed for task ':src:protocol:native:spotbugsMain'.
> SpotBugs rule violations were found. See the report at: file://<https://builds.apache.org/job/JMeter-trunk/ws/src/protocol/native/build/reports/spotbugs/main.xml>

* Try:
Run with --stacktrace option to get the stack trace. Run with --info or --debug option to
get more log output. Run with --scan to get full insights.
==============================================================================

7: Task failed with an exception.
-----------
* What went wrong:
Execution failed for task ':src:protocol:junit:spotbugsMain'.
> SpotBugs rule violations were found. See the report at: file://<https://builds.apache.org/job/JMeter-trunk/ws/src/protocol/junit/build/reports/spotbugs/main.xml>

* Try:
Run with --stacktrace option to get the stack trace. Run with --info or --debug option to
get more log output. Run with --scan to get full insights.
==============================================================================

8: Task failed with an exception.
-----------
* What went wrong:
Execution failed for task ':src:protocol:tcp:spotbugsMain'.
> SpotBugs rule violations were found. See the report at: file://<https://builds.apache.org/job/JMeter-trunk/ws/src/protocol/tcp/build/reports/spotbugs/main.xml>

* Try:
Run with --stacktrace option to get the stack trace. Run with --info or --debug option to
get more log output. Run with --scan to get full insights.
==============================================================================

9: Task failed with an exception.
-----------
* What went wrong:
Execution failed for task ':src:protocol:mail:spotbugsMain'.
> SpotBugs rule violations were found. See the report at: file://<https://builds.apache.org/job/JMeter-trunk/ws/src/protocol/mail/build/reports/spotbugs/main.xml>

* Try:
Run with --stacktrace option to get the stack trace. Run with --info or --debug option to
get more log output. Run with --scan to get full insights.
==============================================================================

10: Task failed with an exception.
-----------
* What went wrong:
Execution failed for task ':src:protocol:jms:spotbugsMain'.
> SpotBugs rule violations were found. See the report at: file://<https://builds.apache.org/job/JMeter-trunk/ws/src/protocol/jms/build/reports/spotbugs/main.xml>

* Try:
Run with --stacktrace option to get the stack trace. Run with --info or --debug option to
get more log output. Run with --scan to get full insights.
==============================================================================

11: Task failed with an exception.
-----------
* What went wrong:
Execution failed for task ':src:jorphan:spotbugsMain'.
> SpotBugs rule violations were found. See the report at: file://<https://builds.apache.org/job/JMeter-trunk/ws/src/jorphan/build/reports/spotbugs/main.xml>

* Try:
Run with --stacktrace option to get the stack trace. Run with --info or --debug option to
get more log output. Run with --scan to get full insights.
==============================================================================

* Get more help at https://help.gradle.org

Deprecated Gradle features were used in this build, making it incompatible with Gradle 6.0.
Use '--warning-mode all' to show the individual deprecation warnings.
See https://docs.gradle.org/5.5.1/userguide/command_line_interface.html#sec:command_line_warnings

BUILD FAILED in 1m 9s
108 actionable tasks: 39 executed, 69 up-to-date
Build step 'Invoke Gradle script' changed build result to FAILURE
Build step 'Invoke Gradle script' marked build as failure
WARN: Found multiple 'report-task.txt' in the workspace. Taking the first one.
<https://builds.apache.org/job/JMeter-trunk/ws/.sonar/report-task.txt>
<https://builds.apache.org/job/JMeter-trunk/ws/build/sonar/report-task.txt>
[locks-and-latches] Releasing all the locks
[locks-and-latches] All the locks released
Archiving artifacts
[Fast Archiver] Compressed 61.93 MB of artifacts by 26.3% relative to #7281
Recording test results
ERROR: Step ?Publish JUnit test result report? failed: Test reports were found but none of
them are new. Did leafNodes run? 
For example, <https://builds.apache.org/job/JMeter-trunk/ws/src/components/build/test-results/test/TEST-org.apache.jmeter.assertions.DurationAssertionTest.xml>
is 22 hr old


Mime
View raw message