jmeter-dev mailing list archives

Site index · List index
Message view « Date » · « Thread »
Top « Date » · « Thread »
From Apache Jenkins Server <jenk...@builds.apache.org>
Subject Build failed in Jenkins: JMeter-trunk #7283
Date Sat, 03 Aug 2019 11:58:31 GMT
See <https://builds.apache.org/job/JMeter-trunk/7283/display/redirect?page=changes>

Changes:

[felix.schumacher] Markup changes.

[felix.schumacher] Use correct project name

[felix.schumacher] Markup and one missing gradle conversion

[felix.schumacher] Markup changes, small fixes and ant to gradle

[felix.schumacher] Use https in docs wherever possible

[sitnikov.vladimir] Dislpay stdout for test execution

[sitnikov.vladimir] Add org.gradle:gradle-wrapper to source LICENSE file

------------------------------------------
[...truncated 2.64 KB...]
> Task :buildSrc:processResources NO-SOURCE
> Task :buildSrc:classes UP-TO-DATE
> Task :buildSrc:inspectClassesForKotlinIC UP-TO-DATE
> Task :buildSrc:jar UP-TO-DATE
> Task :buildSrc:assemble UP-TO-DATE
> Task :buildSrc:compileTestKotlin NO-SOURCE
> Task :buildSrc:compileTestJava NO-SOURCE
> Task :buildSrc:compileTestGroovy NO-SOURCE
> Task :buildSrc:processTestResources NO-SOURCE
> Task :buildSrc:testClasses UP-TO-DATE
> Task :buildSrc:validateTaskProperties UP-TO-DATE
> Task :buildSrc:batchtest:compileKotlin UP-TO-DATE
> Task :buildSrc:batchtest:compileJava NO-SOURCE
> Task :buildSrc:batchtest:pluginDescriptors UP-TO-DATE
> Task :buildSrc:batchtest:processResources UP-TO-DATE
> Task :buildSrc:batchtest:classes UP-TO-DATE
> Task :buildSrc:batchtest:inspectClassesForKotlinIC UP-TO-DATE
> Task :buildSrc:batchtest:jar UP-TO-DATE
> Task :buildSrc:batchtest:assemble UP-TO-DATE
> Task :buildSrc:batchtest:compileTestKotlin NO-SOURCE
> Task :buildSrc:batchtest:pluginUnderTestMetadata UP-TO-DATE
> Task :buildSrc:batchtest:compileTestJava NO-SOURCE
> Task :buildSrc:batchtest:processTestResources NO-SOURCE
> Task :buildSrc:batchtest:testClasses UP-TO-DATE
> Task :buildSrc:batchtest:test NO-SOURCE
> Task :buildSrc:pluginUnderTestMetadata UP-TO-DATE
> Task :buildSrc:batchtest:validateTaskProperties UP-TO-DATE
> Task :buildSrc:batchtest:check UP-TO-DATE
> Task :buildSrc:batchtest:build UP-TO-DATE
> Task :buildSrc:test NO-SOURCE
> Task :buildSrc:check UP-TO-DATE
> Task :buildSrc:build UP-TO-DATE

> Configure project :
Building JMeter 5.2.0-SNAPSHOT

> Task :src:bom:check UP-TO-DATE
> Task :src:protocol:ldap:processResources NO-SOURCE
> Task :src:config:compileJava NO-SOURCE
> Task :compileJava NO-SOURCE
> Task :src:protocol:native:processResources NO-SOURCE
> Task :src:protocol:junit-sample:processResources NO-SOURCE
> Task :src:functions:processResources UP-TO-DATE
> Task :src:protocol:ftp:processResources NO-SOURCE
> Task :src:protocol:junit:processResources NO-SOURCE
> Task :src:dist-check:processResources NO-SOURCE
> Task :src:protocol:jms:processResources NO-SOURCE
> Task :src:protocol:tcp:processResources NO-SOURCE
> Task :src:dist:processResources NO-SOURCE
> Task :src:protocol:native:processTestResources NO-SOURCE
> Task :processResources NO-SOURCE
> Task :classes UP-TO-DATE
> Task :src:protocol:tcp:processTestResources NO-SOURCE
> Task :src:dist:processTestResources NO-SOURCE
> Task :src:protocol:java:processResources UP-TO-DATE
> Task :src:protocol:ftp:processTestResources NO-SOURCE
> Task :src:generator:processResources NO-SOURCE
> Task :src:licenses:compileJava NO-SOURCE
> Task :src:config:processResources NO-SOURCE
> Task :src:protocol:junit:processTestResources NO-SOURCE
> Task :src:protocol:mail:processResources UP-TO-DATE
> Task :src:protocol:compileJava NO-SOURCE
> Task :src:protocol:http:processResources UP-TO-DATE
> Task :src:examples:processResources UP-TO-DATE
> Task :src:bshclient:compileJava UP-TO-DATE
> Task :src:launcher:compileJava UP-TO-DATE
> Task :src:dist-check:processTestResources UP-TO-DATE
> Task :src:protocol:mongodb:processResources UP-TO-DATE
> Task :src:protocol:ldap:processTestResources NO-SOURCE
> Task :checkstyleMain NO-SOURCE
> Task :src:protocol:jms:processTestResources UP-TO-DATE
> Task :src:config:classes UP-TO-DATE
> Task :src:protocol:mongodb:processTestResources NO-SOURCE
> Task :src:functions:processTestResources UP-TO-DATE
> Task :src:examples:processTestResources NO-SOURCE
> Task :src:generator:processTestResources NO-SOURCE
> Task :src:bshclient:processResources NO-SOURCE
> Task :src:protocol:java:processTestResources NO-SOURCE
> Task :src:config:checkstyleMain NO-SOURCE
> Task :src:licenses:processResources NO-SOURCE
> Task :src:bom:assemble UP-TO-DATE
> Task :src:protocol:processResources NO-SOURCE
> Task :src:release:compileJava NO-SOURCE
> Task :src:protocol:mail:processTestResources NO-SOURCE
> Task :src:protocol:junit-sample:processTestResources NO-SOURCE
> Task :src:protocol:classes UP-TO-DATE
> Task :compileTestJava NO-SOURCE
> Task :src:bshclient:classes UP-TO-DATE
> Task :src:release:processResources NO-SOURCE
> Task :src:licenses:classes UP-TO-DATE
> Task :processTestResources NO-SOURCE
> Task :src:config:compileTestJava NO-SOURCE
> Task :src:protocol:jdbc:processResources UP-TO-DATE
> Task :src:config:processTestResources NO-SOURCE
> Task :src:licenses:checkstyleMain NO-SOURCE
> Task :src:launcher:processResources UP-TO-DATE
> Task :src:launcher:classes UP-TO-DATE
> Task :src:config:testClasses UP-TO-DATE
> Task :testClasses UP-TO-DATE
> Task :src:protocol:checkstyleMain NO-SOURCE
> Task :src:release:classes UP-TO-DATE
> Task :src:config:checkstyleTest NO-SOURCE
> Task :src:licenses:compileTestJava NO-SOURCE
> Task :src:protocol:jdbc:processTestResources NO-SOURCE
> Task :src:config:spotbugsMain NO-SOURCE
> Task :src:licenses:processTestResources NO-SOURCE
> Task :src:release:checkstyleMain NO-SOURCE
> Task :src:licenses:testClasses UP-TO-DATE
> Task :src:protocol:compileTestJava NO-SOURCE
> Task :checkstyleTest NO-SOURCE
> Task :src:protocol:processTestResources NO-SOURCE
> Task :src:protocol:testClasses UP-TO-DATE
> Task :src:dist:preparePropertiesbuildPrintableDoc
> Task :src:protocol:checkstyleTest NO-SOURCE
> Task :src:protocol:http:processTestResources UP-TO-DATE
> Task :src:launcher:jar UP-TO-DATE
> Task :src:licenses:checkstyleTest NO-SOURCE
> Task :src:config:spotbugsTest NO-SOURCE
> Task :src:release:compileTestJava NO-SOURCE
> Task :src:core:versionClass
> Task :src:licenses:spotbugsMain NO-SOURCE
> Task :src:release:processTestResources NO-SOURCE
> Task :src:protocol:spotbugsMain NO-SOURCE
> Task :src:release:testClasses UP-TO-DATE
> Task :src:config:test NO-SOURCE
> Task :src:config:check UP-TO-DATE
> Task :src:release:checkstyleTest NO-SOURCE
> Task :src:protocol:spotbugsTest NO-SOURCE
> Task :src:release:spotbugsMain NO-SOURCE
> Task :src:licenses:spotbugsTest NO-SOURCE
> Task :src:release:spotbugsTest NO-SOURCE
> Task :src:protocol:test NO-SOURCE
> Task :src:protocol:check UP-TO-DATE
> Task :src:licenses:test NO-SOURCE
> Task :src:licenses:check UP-TO-DATE
> Task :src:release:test NO-SOURCE
> Task :src:release:check UP-TO-DATE
> Task :src:components:processResources UP-TO-DATE
> Task :src:components:processTestResources UP-TO-DATE
> Task :src:jorphan:compileJava UP-TO-DATE
> Task :src:jorphan:compileGroovy NO-SOURCE
> Task :src:jorphan:processResources UP-TO-DATE
> Task :src:jorphan:classes UP-TO-DATE
> Task :src:protocol:jar
> Task :src:release:jar
> Task :src:protocol:assemble
> Task :src:release:assemble
> Task :src:jorphan:jar UP-TO-DATE
> Task :src:launcher:checkstyleMain UP-TO-DATE
> Task :src:bshclient:checkstyleMain UP-TO-DATE
> Task :src:launcher:compileTestJava NO-SOURCE
> Task :src:launcher:processTestResources NO-SOURCE
> Task :src:launcher:testClasses UP-TO-DATE
> Task :src:launcher:checkstyleTest NO-SOURCE
> Task :src:licenses:gatherSourceLicenses
> Task :src:bshclient:compileTestJava NO-SOURCE
> Task :src:bshclient:processTestResources NO-SOURCE
> Task :src:bshclient:testClasses UP-TO-DATE
> Task :src:bshclient:checkstyleTest NO-SOURCE
> Task :src:core:processResources UP-TO-DATE
> Task :src:dist-check:populateLibs
> Task :src:jorphan:compileTestJava UP-TO-DATE
> Task :src:jorphan:compileTestGroovy UP-TO-DATE
> Task :src:jorphan:processTestResources NO-SOURCE
> Task :src:jorphan:testClasses UP-TO-DATE
> Task :src:jorphan:testJar UP-TO-DATE
> Task :src:jorphan:checkstyleMain UP-TO-DATE
> Task :src:jorphan:checkstyleTest UP-TO-DATE

> Task :src:licenses:renderLicenseForSource
Dependencies of license category B are not allowed for SOURCE artifacts
=======================================================================

CC-BY-SA-3.0
* openiconlibrary:openiconlibrary:

OFL-1.1
* font-awesome-font:font-awesome-font:4.2.0


> Task :src:config:renderLicenseForSourceCopySpec
> Task :src:licenses:jar
> Task :src:licenses:assemble
> Task :gitProps
> Task :src:config:jar
> Task :src:config:assemble
> Task :spotbugsMain NO-SOURCE
> Task :spotbugsTest NO-SOURCE
> Task :test NO-SOURCE
> Task :jar
> Task :assemble
> Task :rat
> Task :check
> Task :src:dist:buildPrintableDoc
> Task :src:dist:renderLicenseForSourceCopySpec
> Task :src:bshclient:spotbugsMain FAILED

> Task :src:core:compileJava
Note: Some input files use or override a deprecated API.
Note: Recompile with -Xlint:deprecation for details.
Note: <https://builds.apache.org/job/JMeter-trunk/ws/src/core/src/main/java/org/apache/jmeter/save/converters/TestElementPropertyConverter.java>
uses unchecked or unsafe operations.
Note: Recompile with -Xlint:unchecked for details.

> Task :src:launcher:spotbugsMain
> Task :src:dist:distTarSource
> Task :src:jorphan:spotbugsMain FAILED

FAILURE: Build completed with 2 failures.

1: Task failed with an exception.
-----------
* What went wrong:
Execution failed for task ':src:bshclient:spotbugsMain'.
> SpotBugs rule violations were found. See the report at: file://<https://builds.apache.org/job/JMeter-trunk/ws/src/bshclient/build/reports/spotbugs/main.xml>

* Try:
Run with --stacktrace option to get the stack trace. Run with --info or --debug option to
get more log output. Run with --scan to get full insights.
==============================================================================

2: Task failed with an exception.
-----------
* What went wrong:
Execution failed for task ':src:jorphan:spotbugsMain'.
> SpotBugs rule violations were found. See the report at: file://<https://builds.apache.org/job/JMeter-trunk/ws/src/jorphan/build/reports/spotbugs/main.xml>

* Try:
Run with --stacktrace option to get the stack trace. Run with --info or --debug option to
get more log output. Run with --scan to get full insights.
==============================================================================

* Get more help at https://help.gradle.org

Deprecated Gradle features were used in this build, making it incompatible with Gradle 6.0.
Use '--warning-mode all' to show the individual deprecation warnings.
See https://docs.gradle.org/5.5.1/userguide/command_line_interface.html#sec:command_line_warnings

BUILD FAILED in 1m 1s
48 actionable tasks: 20 executed, 28 up-to-date
Build step 'Invoke Gradle script' changed build result to FAILURE
Build step 'Invoke Gradle script' marked build as failure
WARN: Found multiple 'report-task.txt' in the workspace. Taking the first one.
<https://builds.apache.org/job/JMeter-trunk/ws/.sonar/report-task.txt>
<https://builds.apache.org/job/JMeter-trunk/ws/build/sonar/report-task.txt>
[locks-and-latches] Releasing all the locks
[locks-and-latches] All the locks released
Archiving artifacts
Recording test results
ERROR: Step ?Publish JUnit test result report? failed: Test reports were found but none of
them are new. Did leafNodes run? 
For example, <https://builds.apache.org/job/JMeter-trunk/ws/src/components/build/test-results/test/TEST-org.apache.jmeter.assertions.DurationAssertionTest.xml>
is 18 hr old


Mime
View raw message