jmeter-dev mailing list archives

Site index · List index
Message view « Date » · « Thread »
Top « Date » · « Thread »
From Apache Jenkins Server <jenk...@builds.apache.org>
Subject Build failed in Jenkins: JMeter-trunk #7282
Date Fri, 02 Aug 2019 21:11:26 GMT
See <https://builds.apache.org/job/JMeter-trunk/7282/display/redirect>

------------------------------------------
[...truncated 62.42 KB...]
> Task :src:examples:testClasses UP-TO-DATE
> Task :src:protocol:http:compileGroovy NO-SOURCE
> Task :src:protocol:http:classes UP-TO-DATE
> Task :src:functions:jar UP-TO-DATE
> Task :src:examples:checkstyleTest NO-SOURCE
> Task :src:generator:checkstyleMain UP-TO-DATE
> Task :src:examples:jar UP-TO-DATE
> Task :src:protocol:http:jar UP-TO-DATE
> Task :src:generator:compileTestJava NO-SOURCE
> Task :src:generator:testClasses UP-TO-DATE
> Task :src:generator:checkstyleTest NO-SOURCE
> Task :src:functions:checkstyleMain UP-TO-DATE
> Task :src:examples:assemble UP-TO-DATE
> Task :src:functions:assemble UP-TO-DATE
> Task :src:generator:assemble UP-TO-DATE
> Task :src:components:compileTestJava UP-TO-DATE
> Task :src:components:compileTestGroovy UP-TO-DATE
> Task :src:components:testClasses UP-TO-DATE
> Task :src:protocol:http:checkstyleMain UP-TO-DATE
> Task :src:protocol:http:assemble UP-TO-DATE
> Task :src:components:checkstyleTest UP-TO-DATE
> Task :rat
> Task :check
> Task :src:dist:distTarSource
> Task :src:dist:compileJava NO-SOURCE
> Task :src:dist:classes UP-TO-DATE
> Task :src:dist-check:compileJava NO-SOURCE
> Task :src:dist-check:compileGroovy NO-SOURCE
> Task :src:dist-check:classes UP-TO-DATE
> Task :src:dist-check:checkstyleMain NO-SOURCE
> Task :src:dist:checkstyleMain NO-SOURCE
> Task :src:dist:jar UP-TO-DATE
> Task :src:dist-check:jar UP-TO-DATE
> Task :src:dist-check:assemble UP-TO-DATE
> Task :src:dist:javadocAggregate UP-TO-DATE
> Task :src:dist:distTarSourceSha512
> Task :src:launcher:spotbugsMain
> Task :src:bshclient:spotbugsMain
> Task :src:jorphan:spotbugsMain
> Task :src:bshclient:spotbugsMain FAILED
> Task :src:protocol:junit-sample:spotbugsMain
> Task :src:protocol:ldap:spotbugsMain
> Task :src:protocol:tcp:spotbugsMain
> Task :src:protocol:java:spotbugsMain
> Task :src:protocol:mongodb:spotbugsMain
> Task :src:protocol:junit:spotbugsMain
> Task :src:protocol:native:spotbugsMain
> Task :src:protocol:jms:spotbugsMain
> Task :src:protocol:mail:spotbugsMain
> Task :src:protocol:jdbc:spotbugsMain
> Task :src:core:spotbugsMain
> Task :src:protocol:ftp:spotbugsMain
> Task :src:components:spotbugsMain
> Task :src:protocol:junit-sample:spotbugsMain FAILED
> Task :src:protocol:mongodb:spotbugsMain FAILED
> Task :src:protocol:native:spotbugsMain FAILED
> Task :src:dist:distZipSource
> Task :src:protocol:ftp:spotbugsMain FAILED
> Task :src:protocol:jdbc:spotbugsMain FAILED
> Task :src:protocol:junit:spotbugsMain FAILED
> Task :src:protocol:tcp:spotbugsMain FAILED
> Task :src:protocol:mail:spotbugsMain FAILED
> Task :src:protocol:jms:spotbugsMain FAILED
> Task :src:jorphan:spotbugsMain FAILED

> Task :src:components:spotbugsMain
The following classes needed for analysis were missing:
  org.bouncycastle.asn1.x500.style.BCStyle
  org.bouncycastle.asn1.ASN1ObjectIdentifier
  org.bouncycastle.asn1.ASN1Encodable
  org.bouncycastle.asn1.x509.Extension
  org.bouncycastle.operator.DigestCalculatorProvider
  org.bouncycastle.util.Selector
  org.bouncycastle.cert.X509CertificateHolder
  org.bouncycastle.cms.SignerInformationVerifier
  org.bouncycastle.mail.smime.SMIMESignedParser
  org.bouncycastle.operator.bc.BcDigestCalculatorProvider
  org.bouncycastle.cms.CMSException
  org.bouncycastle.mail.smime.SMIMEException
  org.bouncycastle.cms.SignerInformationStore
  org.bouncycastle.cms.SignerInformation
  org.bouncycastle.util.Store
  org.bouncycastle.cms.jcajce.JcaSimpleSignerInfoVerifierBuilder
  org.bouncycastle.asn1.x500.X500Name
  org.bouncycastle.cert.jcajce.JcaX509CertificateHolder
  org.bouncycastle.asn1.x500.RDN
  org.bouncycastle.asn1.x500.AttributeTypeAndValue
  org.bouncycastle.asn1.x500.style.IETFUtils
  org.bouncycastle.asn1.x509.GeneralNames
  org.bouncycastle.asn1.x509.GeneralName
  org.bouncycastle.jce.provider.BouncyCastleProvider
  org.bouncycastle.operator.OperatorCreationException

> Task :src:components:spotbugsMain FAILED
> Task :src:core:spotbugsMain FAILED

FAILURE: Build completed with 13 failures.

1: Task failed with an exception.
-----------
* What went wrong:
Execution failed for task ':src:bshclient:spotbugsMain'.
> SpotBugs rule violations were found. See the report at: file://<https://builds.apache.org/job/JMeter-trunk/ws/src/bshclient/build/reports/spotbugs/main.xml>

* Try:
Run with --stacktrace option to get the stack trace. Run with --info or --debug option to
get more log output. Run with --scan to get full insights.
==============================================================================

2: Task failed with an exception.
-----------
* What went wrong:
Execution failed for task ':src:protocol:junit-sample:spotbugsMain'.
> SpotBugs rule violations were found. See the report at: file://<https://builds.apache.org/job/JMeter-trunk/ws/src/protocol/junit-sample/build/reports/spotbugs/main.xml>

* Try:
Run with --stacktrace option to get the stack trace. Run with --info or --debug option to
get more log output. Run with --scan to get full insights.
==============================================================================

3: Task failed with an exception.
-----------
* What went wrong:
Execution failed for task ':src:protocol:mongodb:spotbugsMain'.
> SpotBugs rule violations were found. See the report at: file://<https://builds.apache.org/job/JMeter-trunk/ws/src/protocol/mongodb/build/reports/spotbugs/main.xml>

* Try:
Run with --stacktrace option to get the stack trace. Run with --info or --debug option to
get more log output. Run with --scan to get full insights.
==============================================================================

4: Task failed with an exception.
-----------
* What went wrong:
Execution failed for task ':src:protocol:native:spotbugsMain'.
> SpotBugs rule violations were found. See the report at: file://<https://builds.apache.org/job/JMeter-trunk/ws/src/protocol/native/build/reports/spotbugs/main.xml>

* Try:
Run with --stacktrace option to get the stack trace. Run with --info or --debug option to
get more log output. Run with --scan to get full insights.
==============================================================================

5: Task failed with an exception.
-----------
* What went wrong:
Execution failed for task ':src:protocol:ftp:spotbugsMain'.
> SpotBugs rule violations were found. See the report at: file://<https://builds.apache.org/job/JMeter-trunk/ws/src/protocol/ftp/build/reports/spotbugs/main.xml>

* Try:
Run with --stacktrace option to get the stack trace. Run with --info or --debug option to
get more log output. Run with --scan to get full insights.
==============================================================================

6: Task failed with an exception.
-----------
* What went wrong:
Execution failed for task ':src:protocol:jdbc:spotbugsMain'.
> SpotBugs rule violations were found. See the report at: file://<https://builds.apache.org/job/JMeter-trunk/ws/src/protocol/jdbc/build/reports/spotbugs/main.xml>

* Try:
Run with --stacktrace option to get the stack trace. Run with --info or --debug option to
get more log output. Run with --scan to get full insights.
==============================================================================

7: Task failed with an exception.
-----------
* What went wrong:
Execution failed for task ':src:protocol:junit:spotbugsMain'.
> SpotBugs rule violations were found. See the report at: file://<https://builds.apache.org/job/JMeter-trunk/ws/src/protocol/junit/build/reports/spotbugs/main.xml>

* Try:
Run with --stacktrace option to get the stack trace. Run with --info or --debug option to
get more log output. Run with --scan to get full insights.
==============================================================================

8: Task failed with an exception.
-----------
* What went wrong:
Execution failed for task ':src:protocol:tcp:spotbugsMain'.
> SpotBugs rule violations were found. See the report at: file://<https://builds.apache.org/job/JMeter-trunk/ws/src/protocol/tcp/build/reports/spotbugs/main.xml>

* Try:
Run with --stacktrace option to get the stack trace. Run with --info or --debug option to
get more log output. Run with --scan to get full insights.
==============================================================================

9: Task failed with an exception.
-----------
* What went wrong:
Execution failed for task ':src:protocol:mail:spotbugsMain'.
> SpotBugs rule violations were found. See the report at: file://<https://builds.apache.org/job/JMeter-trunk/ws/src/protocol/mail/build/reports/spotbugs/main.xml>

* Try:
Run with --stacktrace option to get the stack trace. Run with --info or --debug option to
get more log output. Run with --scan to get full insights.
==============================================================================

10: Task failed with an exception.
-----------
* What went wrong:
Execution failed for task ':src:protocol:jms:spotbugsMain'.
> SpotBugs rule violations were found. See the report at: file://<https://builds.apache.org/job/JMeter-trunk/ws/src/protocol/jms/build/reports/spotbugs/main.xml>

* Try:
Run with --stacktrace option to get the stack trace. Run with --info or --debug option to
get more log output. Run with --scan to get full insights.
==============================================================================

11: Task failed with an exception.
-----------
* What went wrong:
Execution failed for task ':src:jorphan:spotbugsMain'.
> SpotBugs rule violations were found. See the report at: file://<https://builds.apache.org/job/JMeter-trunk/ws/src/jorphan/build/reports/spotbugs/main.xml>

* Try:
Run with --stacktrace option to get the stack trace. Run with --info or --debug option to
get more log output. Run with --scan to get full insights.
==============================================================================

12: Task failed with an exception.
-----------
* What went wrong:
Execution failed for task ':src:components:spotbugsMain'.
> SpotBugs rule violations were found. See the report at: file://<https://builds.apache.org/job/JMeter-trunk/ws/src/components/build/reports/spotbugs/main.xml>

* Try:
Run with --stacktrace option to get the stack trace. Run with --info or --debug option to
get more log output. Run with --scan to get full insights.
==============================================================================

13: Task failed with an exception.
-----------
* What went wrong:
Execution failed for task ':src:core:spotbugsMain'.
> SpotBugs rule violations were found. See the report at: file://<https://builds.apache.org/job/JMeter-trunk/ws/src/core/build/reports/spotbugs/main.xml>

* Try:
Run with --stacktrace option to get the stack trace. Run with --info or --debug option to
get more log output. Run with --scan to get full insights.
==============================================================================

* Get more help at https://help.gradle.org

Deprecated Gradle features were used in this build, making it incompatible with Gradle 6.0.
Use '--warning-mode all' to show the individual deprecation warnings.
See https://docs.gradle.org/5.5.1/userguide/command_line_interface.html#sec:command_line_warnings

BUILD FAILED in 1m 32s
126 actionable tasks: 24 executed, 102 up-to-date
Build step 'Invoke Gradle script' changed build result to FAILURE
Build step 'Invoke Gradle script' marked build as failure
WARN: Found multiple 'report-task.txt' in the workspace. Taking the first one.
<https://builds.apache.org/job/JMeter-trunk/ws/.sonar/report-task.txt>
<https://builds.apache.org/job/JMeter-trunk/ws/build/sonar/report-task.txt>
[locks-and-latches] Releasing all the locks
[locks-and-latches] All the locks released
Archiving artifacts
[Fast Archiver] Compressed 161.84 MB of artifacts by 99.9% relative to #7281
Recording test results
ERROR: Step ?Publish JUnit test result report? failed: Test reports were found but none of
them are new. Did leafNodes run? 
For example, <https://builds.apache.org/job/JMeter-trunk/ws/src/components/build/test-results/test/TEST-org.apache.jmeter.assertions.DurationAssertionTest.xml>
is 39 min old


Mime
View raw message