jmeter-dev mailing list archives

Site index · List index
Message view « Date » · « Thread »
Top « Date » · « Thread »
From Apache Jenkins Server <jenk...@builds.apache.org>
Subject Build failed in Jenkins: JMeter-trunk #7289
Date Sat, 03 Aug 2019 20:00:38 GMT
See <https://builds.apache.org/job/JMeter-trunk/7289/display/redirect?page=changes>

Changes:

[sitnikov.vladimir] Build script: move JavaPluginConvention to the top of JavaPlugin block

------------------------------------------
[...truncated 105.21 KB...]
    Locale=en_US
    java.class.version=52.0
    java.awt.headless=true
    os.name=Linux
    os.version=4.4.0-143-generic
    os.arch=amd64

org.apache.jmeter.samplers.TestSampleResult > testSubResultsFalsePause FAILED
    java.lang.AssertionError: TestElapsed: 425 -  ParentElapsed: 401 => 24 not in [0,16];
nanotime=false
        at org.junit.Assert.fail(Assert.java:88)
        at org.apache.jmeter.samplers.TestSampleResult.testSubResults(TestSampleResult.java:292)
        at org.apache.jmeter.samplers.TestSampleResult.testSubResults(TestSampleResult.java:198)
        at org.apache.jmeter.samplers.TestSampleResult.testSubResultsFalsePause(TestSampleResult.java:181)

> Task :src:components:check
> Task :src:components:jar UP-TO-DATE
> Task :src:dist-check:spotbugsMain NO-SOURCE
> Task :src:components:testJar UP-TO-DATE
> Task :src:components:assemble UP-TO-DATE
> Task :src:licenses:gatherBinaryLicenses
> Task :src:licenses:renderLicenseForBinary UP-TO-DATE

> Task :src:core:test

org.apache.jmeter.resources.PackageTest > checkI18n STANDARD_OUT
    Ignoring missing junit_failure_default_code=0001 in org/apache/jmeter/resources/messages_fr.properties
    Ignoring missing aggregate_report_90=90% in org/apache/jmeter/resources/messages_fr.properties
    Ignoring missing junit_error_default_code=9999 in org/apache/jmeter/resources/messages_fr.properties
    Ignoring missing junit_success_default_code=1000 in org/apache/jmeter/resources/messages_fr.properties

org.apache.jmeter.JMeterTest > testSuccessWhenJmxExists STANDARD_OUT
    Creating summariser <summary>
    Created the tree successfully using /tmp/testPlan8422232465890101075.jmx
    Starting the test @ Sat Aug 03 20:00:00 UTC 2019 (1564862400489)

org.apache.jmeter.JMeterTest STANDARD_OUT
    Waiting for possible Shutdown/StopTestNow/HeapDump/ThreadDump message on port 4445

org.apache.jmeter.JMeterTest > testFailureWithMissingPlugin STANDARD_OUT
    Error in NonGUIDriver java.lang.IllegalArgumentException: Problem loading XML from:'/tmp/testPlan5768732010071355640.jmx'.

    Cause:
    CannotResolveClassException: kg.apc.jmeter.samplers.DummySampler

     Detail:com.thoughtworks.xstream.converters.ConversionException: 
    ---- Debugging information ----
    cause-exception     : com.thoughtworks.xstream.converters.ConversionException
    cause-message       : 
    first-jmeter-class  : org.apache.jmeter.save.converters.HashTreeConverter.unmarshal(HashTreeConverter.java:67)
    class               : org.apache.jmeter.save.ScriptWrapper
    required-type       : org.apache.jmeter.save.ScriptWrapper
    converter-type      : org.apache.jmeter.save.ScriptWrapperConverter
    path                : /jmeterTestPlan/hashTree/hashTree/hashTree/kg.apc.jmeter.samplers.DummySampler
    line number         : 16
    version             : not available
    -------------------------------

org.apache.jmeter.testbeans.gui.TestFieldStringEditor > testSetGetAsText STANDARD_OUT
    summary =      0 in 00:00:00 = ******/s Avg:     0 Min: 9223372036854775807 Max: -9223372036854775808
Err:     0 (0.00%)
    Tidying up ...    @ Sat Aug 03 20:00:01 UTC 2019 (1564862401078)
    ... end of run
    JMeterUtils.getJMeterVe rsion() = 5.2.0-SNAPSHOT 24f2e8b
    JMeterUtils.getJMeterVe rsion() = 5.2.0-SNAPSHOT 24f2e8b
    JMeterUtils.getJMeterVe rsion() = 5.2.0-SNAPSHOT 24f2e8b

org.apache.jmeter.engine.LocalHostTest > testLocalHost STANDARD_ERROR
    java.rmi.server.hostname=null
    asf929.gq1.ygridcore.net/67.195.81.179
    isSiteLocalAddress:false
    isAnyLocalAddress:false
    isLinkLocalAddress:false
    isLoopbackAddress:false
    isMulticastAddress:false
    localhost/127.0.0.1
    isSiteLocalAddress:false
    isAnyLocalAddress:false
    isLinkLocalAddress:false
    isLoopbackAddress:true
    isMulticastAddress:false
    ====================
    asf929.gq1.ygridcore.net/67.195.81.179
    isSiteLocalAddress:false
    isAnyLocalAddress:false
    isLinkLocalAddress:false
    isLoopbackAddress:false
    isMulticastAddress:false

org.apache.jmeter.engine.LocalHostTest > testInterfaces STANDARD_ERROR
    Interfaces: {name:docker0 (docker0) => [/fe80:0:0:0:42:93ff:fe78:f66d%docker0/64 [null],
/172.17.0.1/16 [/0.0.0.0]], name:enp5s0f0 (enp5s0f0) => [/fe80:0:0:0:28c:faff:fe5b:40f4%enp5s0f0/64
[null], /67.195.81.179/26 [/67.195.81.191]], name:lo (lo) => [/0:0:0:0:0:0:0:1%lo/128 [null],
/127.0.0.1/8 [null]]}
    Choose 172.17.0.1 to talk to external services
    java.rmi.server.hostname=null

org.apache.jmeter.report.processor.ApdexSummaryConsumerSpec > createDataResult contains
apdex, satisfied, tolerated, key STANDARD_OUT
    The JVM should have exited but did not.
    The following non-daemon threads are still running (DestroyJavaVM is OK):
    Thread[/0:0:0:0:0:0:0:1:43968 to /0:0:0:0:0:0:0:1:34165 workers Thread 2,5,main], stackTrace:org.gradle.api.internal.tasks.testing.worker.TestEventSerializer$DefaultTestOutputEventSerializer#write
at line:126
    org.gradle.internal.remote.internal.hub.DefaultMethodArgsSerializer$ArraySerializer#write
at line:79
    org.gradle.internal.remote.internal.hub.DefaultMethodArgsSerializer$ArraySerializer#write
at line:60
    org.gradle.internal.remote.internal.hub.MethodInvocationSerializer$MethodInvocationWriter#writeArgs
at line:75
    org.gradle.internal.remote.internal.hub.MethodInvocationSerializer$MethodInvocationWriter#write
at line:71
    org.gradle.internal.remote.internal.hub.MethodInvocationSerializer$MethodInvocationWriter#write
at line:56
    org.gradle.internal.serialize.kryo.TypeSafeSerializer$2#write at line:43
    org.gradle.internal.remote.internal.hub.InterHubMessageSerializer$MessageWriter#write
at line:102
    org.gradle.internal.remote.internal.hub.InterHubMessageSerializer$MessageWriter#write
at line:87
    org.gradle.internal.remote.internal.inet.SocketConnection#dispatch at line:117
    org.gradle.internal.remote.internal.hub.MessageHub$ConnectionDispatch#run at line:320
    org.gradle.internal.concurrent.ExecutorPolicy$CatchAndRecordFailures#onExecute at line:63
    org.gradle.internal.concurrent.ManagedExecutorImpl$1#run at line:46
    java.util.concurrent.ThreadPoolExecutor#runWorker at line:1149
    java.util.concurrent.ThreadPoolExecutor$Worker#run at line:624
    org.gradle.internal.concurrent.ThreadFactoryImpl$ManagedThreadRunnable#run at line:55
    java.lang.Thread#run at line:748

    Thread[Test worker,5,main], stackTrace:org.codehaus.groovy.runtime.callsite.CallSiteArray#createCallConstructorSite
at line:86
    org.codehaus.groovy.runtime.callsite.CallSiteArray#defaultCallConstructor at line:59
    org.codehaus.groovy.runtime.callsite.AbstractCallSite#callConstructor at line:238
    org.codehaus.groovy.runtime.callsite.AbstractCallSite#callConstructor at line:242
    org.apache.jmeter.report.processor.ApdexSummaryConsumerSpec#$spock_initializeFields at
line:24
    sun.reflect.NativeMethodAccessorImpl#invoke0
    sun.reflect.NativeMethodAccessorImpl#invoke at line:62
    sun.reflect.DelegatingMethodAccessorImpl#invoke at line:43
    java.lang.reflect.Method#invoke at line:498
    org.spockframework.util.ReflectionUtil#invokeMethod at line:200
    org.spockframework.runtime.model.MethodInfo#invoke at line:113
    org.spockframework.runtime.BaseSpecRunner#invokeRaw at line:484
    org.spockframework.runtime.BaseSpecRunner#invoke at line:467
    org.spockframework.runtime.BaseSpecRunner#doRunInitializer at line:364
    org.spockframework.runtime.BaseSpecRunner$7#invoke at line:348
    org.spockframework.runtime.BaseSpecRunner#invokeRaw at line:484
    org.spockframework.runtime.BaseSpecRunner#invoke at line:467
    org.spockframework.runtime.BaseSpecRunner#runInitializer at line:341
    org.spockframework.runtime.BaseSpecRunner#runInitializer at line:336
    org.spockframework.runtime.BaseSpecRunner#initializeAndRunIteration at line:274
    org.spockframework.runtime.BaseSpecRunner#runSimpleFeature at line:266
    org.spockframework.runtime.BaseSpecRunner#doRunFeature at line:260
    org.spockframework.runtime.BaseSpecRunner$5#invoke at line:243
    org.spockframework.runtime.BaseSpecRunner#invokeRaw at line:484
    org.spockframework.runtime.BaseSpecRunner#invoke at line:467
    org.spockframework.runtime.BaseSpecRunner#runFeature at line:235
    org.spockframework.runtime.BaseSpecRunner#runFeatures at line:185
    org.spockframework.runtime.BaseSpecRunner#doRunSpec at line:95
    org.spockframework.runtime.BaseSpecRunner$1#invoke at line:81
    org.spockframework.runtime.BaseSpecRunner#invokeRaw at line:484
    org.spockframework.runtime.BaseSpecRunner#invoke at line:467
    org.spockframework.runtime.BaseSpecRunner#runSpec at line:73
    org.spockframework.runtime.BaseSpecRunner#run at line:64
    org.spockframework.runtime.Sputnik#run at line:63
    org.gradle.api.internal.tasks.testing.junit.JUnitTestClassExecutor#runTestClass at line:110
    org.gradle.api.internal.tasks.testing.junit.JUnitTestClassExecutor#execute at line:58
    org.gradle.api.internal.tasks.testing.junit.JUnitTestClassExecutor#execute at line:38
    org.gradle.api.internal.tasks.testing.junit.AbstractJUnitTestClassProcessor#processTestClass
at line:62
    org.gradle.api.internal.tasks.testing.SuiteTestClassProcessor#processTestClass at line:51
    sun.reflect.GeneratedMethodAccessor6#invoke
    sun.reflect.DelegatingMethodAccessorImpl#invoke at line:43
    java.lang.reflect.Method#invoke at line:498
    org.gradle.internal.dispatch.ReflectionDispatch#dispatch at line:35
    org.gradle.internal.dispatch.ReflectionDispatch#dispatch at line:24
    org.gradle.internal.dispatch.ContextClassLoaderDispatch#dispatch at line:32
    org.gradle.internal.dispatch.ProxyDispatchAdapter$DispatchingInvocationHandler#invoke
at line:93
    com.sun.proxy.$Proxy2#processTestClass
    org.gradle.api.internal.tasks.testing.worker.TestWorker#processTestClass at line:118
    sun.reflect.GeneratedMethodAccessor5#invoke
    sun.reflect.DelegatingMethodAccessorImpl#invoke at line:43
    java.lang.reflect.Method#invoke at line:498
    org.gradle.internal.dispatch.ReflectionDispatch#dispatch at line:35
    org.gradle.internal.dispatch.ReflectionDispatch#dispatch at line:24
    org.gradle.internal.remote.internal.hub.MessageHubBackedObjectConnection$DispatchWrapper#dispatch
at line:175
    org.gradle.internal.remote.internal.hub.MessageHubBackedObjectConnection$DispatchWrapper#dispatch
at line:157
    org.gradle.internal.remote.internal.hub.MessageHub$Handler#run at line:404
    org.gradle.internal.concurrent.ExecutorPolicy$CatchAndRecordFailures#onExecute at line:63
    org.gradle.internal.concurrent.ManagedExecutorImpl$1#run at line:46
    java.util.concurrent.ThreadPoolExecutor#runWorker at line:1149
    java.util.concurrent.ThreadPoolExecutor$Worker#run at line:624
    org.gradle.internal.concurrent.ThreadFactoryImpl$ManagedThreadRunnable#run at line:55
    java.lang.Thread#run at line:748

    Thread[/0:0:0:0:0:0:0:1:43968 to /0:0:0:0:0:0:0:1:34165 workers Thread 3,5,main], stackTrace:sun.nio.ch.EPollArrayWrapper#epollWait
    sun.nio.ch.EPollArrayWrapper#poll at line:269
    sun.nio.ch.EPollSelectorImpl#doSelect at line:93
    sun.nio.ch.SelectorImpl#lockAndDoSelect at line:86
    sun.nio.ch.SelectorImpl#select at line:97
    sun.nio.ch.SelectorImpl#select at line:101
    org.gradle.internal.remote.internal.inet.SocketConnection$SocketInputStream#read at line:179
    com.esotericsoftware.kryo.io.Input#fill at line:146
    com.esotericsoftware.kryo.io.Input#require at line:178
    com.esotericsoftware.kryo.io.Input#readByte at line:295
    org.gradle.internal.serialize.kryo.KryoBackedDecoder#readByte at line:80
    org.gradle.internal.remote.internal.hub.InterHubMessageSerializer$MessageReader#read at
line:63
    org.gradle.internal.remote.internal.hub.InterHubMessageSerializer$MessageReader#read at
line:52
    org.gradle.internal.remote.internal.inet.SocketConnection#receive at line:80
    org.gradle.internal.remote.internal.hub.MessageHub$ConnectionReceive#run at line:263
    org.gradle.internal.concurrent.ExecutorPolicy$CatchAndRecordFailures#onExecute at line:63
    org.gradle.internal.concurrent.ManagedExecutorImpl$1#run at line:46
    java.util.concurrent.ThreadPoolExecutor#runWorker at line:1149
    java.util.concurrent.ThreadPoolExecutor$Worker#run at line:624
    org.gradle.internal.concurrent.ThreadFactoryImpl$ManagedThreadRunnable#run at line:55
    java.lang.Thread#run at line:748

    Thread[main,5,main], stackTrace:sun.misc.Unsafe#park
    java.util.concurrent.locks.LockSupport#park at line:175
    java.util.concurrent.locks.AbstractQueuedSynchronizer#parkAndCheckInterrupt at line:836
    java.util.concurrent.locks.AbstractQueuedSynchronizer#doAcquireSharedInterruptibly at
line:997
    java.util.concurrent.locks.AbstractQueuedSynchronizer#acquireSharedInterruptibly at line:1304
    java.util.concurrent.CountDownLatch#await at line:231
    org.gradle.api.internal.tasks.testing.worker.TestWorker#execute at line:72
    org.gradle.api.internal.tasks.testing.worker.TestWorker#execute at line:46
    org.gradle.process.internal.worker.child.ActionExecutionWorker#execute at line:86
    org.gradle.process.internal.worker.child.ActionExecutionWorker#execute at line:34
    org.gradle.process.internal.worker.child.SystemApplicationClassLoaderWorker#call at line:132
    org.gradle.process.internal.worker.child.SystemApplicationClassLoaderWorker#call at line:68
    worker.org.gradle.process.internal.worker.GradleWorkerMain#run at line:68
    worker.org.gradle.process.internal.worker.GradleWorkerMain#main at line:73


250 tests completed, 1 failed

> Task :src:core:test FAILED
> Task :src:generator:spotbugsMain
> Task :src:examples:spotbugsMain

> Task :src:functions:spotbugsMain
SpotBugs rule violations were found. See the report at: file://<https://builds.apache.org/job/JMeter-trunk/ws/src/functions/build/reports/spotbugs/main.xml>

> Task :src:protocol:http:spotbugsMain
SpotBugs rule violations were found. See the report at: file://<https://builds.apache.org/job/JMeter-trunk/ws/src/protocol/http/build/reports/spotbugs/main.xml>

FAILURE: Build failed with an exception.

* What went wrong:
Execution failed for task ':src:core:test'.
> There were failing tests. See the report at: file://<https://builds.apache.org/job/JMeter-trunk/ws/src/core/build/reports/tests/test/index.html>

* Try:
Run with --stacktrace option to get the stack trace. Run with --info or --debug option to
get more log output. Run with --scan to get full insights.

* Get more help at https://help.gradle.org

Deprecated Gradle features were used in this build, making it incompatible with Gradle 6.0.
Use '--warning-mode all' to show the individual deprecation warnings.
See https://docs.gradle.org/5.5.1/userguide/command_line_interface.html#sec:command_line_warnings

BUILD FAILED in 3m 13s
189 actionable tasks: 86 executed, 103 up-to-date
Build step 'Invoke Gradle script' changed build result to FAILURE
Build step 'Invoke Gradle script' marked build as failure
[locks-and-latches] Releasing all the locks
[locks-and-latches] All the locks released
Archiving artifacts
[Fast Archiver] Compressed 38.26 MB of artifacts by 43.3% relative to #7287
Recording test results

Mime
View raw message