See ------------------------------------------ [...truncated 548.90 KB...] :src:components:compileJava (Thread[Execution worker for ':' Thread 5,5,main]) completed. Took 12.38 secs. > Task :src:core:checkstyleMain [ant:xslt] Processing to [ant:xslt] Loading stylesheet

CheckStyle Audit

Designed for use with CheckStyle and Ant.




Files

Name Errors

File

Error Description Line
Back to top

Summary

Files Errors
a b
:src:core:checkstyleMain (Thread[Execution worker for ':' Thread 22,5,main]) completed. Took 7.308 secs. Gradle Test Executor 3 finished executing tests. > Task :src:jorphan:test FAILED 208 tests completed, 5 failed, 2 skipped Finished generating test XML results (0.003 secs) into: Generating HTML test report... Finished generating test html results (0.013 secs) into: :src:jorphan:test (Thread[Execution worker for ':' Thread 21,5,main]) completed. Took 18.216 secs. Checksum computation time: 223, files processed: 28, bytes processed: 20217145 Closing Git repo: FAILURE: Build completed with 2 failures. 1: Task failed with an exception. ----------- * What went wrong: Execution failed for task ':src:protocol:ldap:test'. > There were failing tests. See the report at: file:// * Try: Run with --stacktrace option to get the stack trace. Run with --debug option to get more log output. Run with --scan to get full insights. ============================================================================== 2: Task failed with an exception. ----------- * What went wrong: Execution failed for task ':src:jorphan:test'. > There were failing tests. See the report at: file:// * Try: Run with --stacktrace option to get the stack trace. Run with --debug option to get more log output. Run with --scan to get full insights. ============================================================================== * Get more help at https://help.gradle.org Deprecated Gradle features were used in this build, making it incompatible with Gradle 6.0. Use '--warning-mode all' to show the individual deprecation warnings. See https://docs.gradle.org/5.5.1/userguide/command_line_interface.html#sec:command_line_warnings BUILD FAILED in 38s 116 actionable tasks: 90 executed, 26 up-to-date Stopped 1 worker daemon(s). Build step 'Invoke Gradle script' changed build result to FAILURE Build step 'Invoke Gradle script' marked build as failure [locks-and-latches] Releasing all the locks [locks-and-latches] All the locks released Archiving artifacts Recording test results