jmeter-dev mailing list archives

Site index · List index
Message view « Date » · « Thread »
Top « Date » · « Thread »
From Apache Jenkins Server <jenk...@builds.apache.org>
Subject Build failed in Jenkins: JMeter Windows #1474
Date Thu, 19 Sep 2019 21:05:44 GMT
See <https://builds.apache.org/job/JMeter%20Windows/1474/display/redirect?page=changes>

Changes:

[pmouawad] ProxyControl: Format, renaming, removed invalid throws and comment fixes

[graham] Fix checkstyle error and use more appropriate while loop

[github] PGP-based dependency verification (#488)

------------------------------------------
[...truncated 100.54 KB...]
Note: Recompile with -Xlint:deprecation for details.

> Task :src:functions:compileJava
Note: F:\jenkins\jenkins-slave\workspace\JMeter Windows\src\functions\src\main\java\org\apache\jmeter\functions\StringFromFile.java
uses or overrides a deprecated API.
Note: Recompile with -Xlint:deprecation for details.

> Task :src:functions:compileGroovy NO-SOURCE
> Task :src:functions:classes
> Task :src:functions:jar
> Task :src:components:compileTestGroovy
> Task :src:components:testClasses
> Task :src:functions:checkstyleMain
> Task :src:components:checkstyleTest
> Task :src:components:spotbugsMain SKIPPED
> Task :src:components:spotbugsTest SKIPPED

> Task :src:components:test

org.apache.jmeter.assertions.DurationAssertionTest STANDARD_OUT
    Setting JMeterHome: F:\jenkins\jenkins-slave\workspace\JMeter Windows\src\components\..\..\.
    Initializing Properties: ../.././bin/jmeter.properties

org.apache.jmeter.assertions.DurationAssertionTest STANDARD_ERROR
    Sep 19, 2019 2:04:10 PM java.util.prefs.WindowsPreferences <init>
    WARNING: Could not open/create prefs root node Software\JavaSoft\Prefs at root 0x80000002.
Windows RegCreateKeyEx(...) returned error code 5.

org.apache.jmeter.assertions.DurationAssertionTest STANDARD_OUT
    JMeterVersion=5.2.0-SNAPSHOT d5cde8a
    java.version=1.8.0_152
    java.vm.name=Java HotSpot(TM) 64-Bit Server VM
    java.vendor=Oracle Corporation
    java.home=F:\jenkins\tools\java\latest1.8\jre
    file.encoding=windows-1252
    default encoding=windows-1252
    user.home=C:\Users\jenkins
    user.dir=F:\jenkins\jenkins-slave\workspace\JMeter Windows\src\components
    user.language=en
    user.region=null
    user.country=US
    user.variant=
    Locale=en_US
    java.class.version=52.0
    java.awt.headless=
    os.name=Windows Server 2016
    os.version=10.0
    os.arch=amd64

> Task :src:protocol:http:compileJava
> Task :src:protocol:http:compileGroovy NO-SOURCE
> Task :src:protocol:http:classes
> Task :src:dist:compileJava NO-SOURCE
> Task :src:dist:classes UP-TO-DATE
> Task :src:dist-check:compileJava NO-SOURCE
> Task :src:dist:checkstyleMain NO-SOURCE
> Task :src:dist-check:compileGroovy NO-SOURCE
> Task :src:dist-check:classes UP-TO-DATE
> Task :src:dist-check:checkstyleMain NO-SOURCE
> Task :src:dist:jar
> Task :src:protocol:http:jar
> Task :src:protocol:http:checkstyleMain
> Task :src:components:check
> Task :src:components:jar
> Task :src:dist:spotbugsMain SKIPPED
> Task :src:dist-check:spotbugsMain SKIPPED
> Task :src:examples:spotbugsMain SKIPPED
> Task :src:functions:spotbugsMain SKIPPED
> Task :src:generator:spotbugsMain SKIPPED
> Task :src:protocol:http:spotbugsMain SKIPPED
> Task :src:generator:spotbugsTest SKIPPED
> Task :src:examples:spotbugsTest SKIPPED
> Task :src:generator:test NO-SOURCE
> Task :src:generator:check
> Task :src:examples:test NO-SOURCE
> Task :src:examples:check
> Task :src:components:testJar
> Task :src:functions:compileTestJava
> Task :src:dist:populateLibs
> Task :src:functions:compileTestGroovy
> Task :src:functions:testClasses

> Task :src:protocol:http:compileTestJava
Note: Some input files use or override a deprecated API.
Note: Recompile with -Xlint:deprecation for details.

> Task :src:functions:testJar
> Task :src:dist:copyBinLibs
> Task :src:functions:checkstyleTest
> Task :src:functions:spotbugsTest SKIPPED
> Task :src:protocol:http:compileTestGroovy
> Task :src:protocol:http:testClasses
> Task :src:protocol:http:testJar

> Task :src:functions:test

org.apache.jmeter.functions.CSVReadFunctionTest STANDARD_OUT
    Setting JMeterHome: F:\jenkins\jenkins-slave\workspace\JMeter Windows\src\functions\..\..\.
    Initializing Properties: ../.././bin/jmeter.properties

org.apache.jmeter.functions.CSVReadFunctionTest STANDARD_ERROR
    Sep 19, 2019 2:04:30 PM java.util.prefs.WindowsPreferences <init>
    WARNING: Could not open/create prefs root node Software\JavaSoft\Prefs at root 0x80000002.
Windows RegCreateKeyEx(...) returned error code 5.

org.apache.jmeter.functions.CSVReadFunctionTest STANDARD_OUT
    JMeterVersion=5.2.0-SNAPSHOT d5cde8a
    java.version=1.8.0_152
    java.vm.name=Java HotSpot(TM) 64-Bit Server VM
    java.vendor=Oracle Corporation
    java.home=F:\jenkins\tools\java\latest1.8\jre
    file.encoding=windows-1252
    default encoding=windows-1252
    user.home=C:\Users\jenkins
    user.dir=F:\jenkins\jenkins-slave\workspace\JMeter Windows\src\functions
    user.language=en
    user.region=null
    user.country=US
    user.variant=
    Locale=en_US
    java.class.version=52.0
    java.awt.headless=
    os.name=Windows Server 2016
    os.version=10.0
    os.arch=amd64

> Task :src:dist-check:compileTestJava
> Task :src:protocol:http:checkstyleTest
> Task :src:protocol:http:spotbugsTest SKIPPED
> Task :src:dist-check:compileTestGroovy
> Task :src:dist-check:testClasses
> Task :src:dist-check:checkstyleTest
> Task :src:dist-check:spotbugsTest SKIPPED

> Task :src:protocol:http:test

org.apache.jmeter.gui.action.ParseCurlCommandActionTest > testCreateCookieManager STANDARD_ERROR
    Sep 19, 2019 2:04:32 PM java.util.prefs.WindowsPreferences <init>
    WARNING: Could not open/create prefs root node Software\JavaSoft\Prefs at root 0x80000002.
Windows RegCreateKeyEx(...) returned error code 5.

org.apache.jmeter.protocol.http.config.UrlConfigTest STANDARD_OUT
    Setting JMeterHome: F:\jenkins\jenkins-slave\workspace\JMeter Windows\src\protocol\http\..\..\..\.
    Initializing Properties: ../../.././bin/jmeter.properties
    JMeterVersion=5.2.0-SNAPSHOT d5cde8a
    java.version=1.8.0_152
    java.vm.name=Java HotSpot(TM) 64-Bit Server VM
    java.vendor=Oracle Corporation
    java.home=F:\jenkins\tools\java\latest1.8\jre
    file.encoding=windows-1252
    default encoding=windows-1252
    user.home=C:\Users\jenkins
    user.dir=F:\jenkins\jenkins-slave\workspace\JMeter Windows\src\protocol\http
    user.language=en
    user.region=null
    user.country=US
    user.variant=
    Locale=en_US
    java.class.version=52.0
    java.awt.headless=
    os.name=Windows Server 2016
    os.version=10.0
    os.arch=amd64

> Task :src:functions:check
> Task :src:dist:copyLibs
> Task :src:dist:compileTestJava NO-SOURCE
> Task :src:dist:testClasses UP-TO-DATE
> Task :src:dist:checkstyleTest NO-SOURCE
> Task :src:dist:spotbugsTest SKIPPED
> Task :src:dist:test NO-SOURCE
> Task :src:dist:check UP-TO-DATE
> Task :src:dist:createDist
> Task :src:dist-check:copyExtraTestLibs

> Task :src:dist-check:batchBUG_62847
Sep 19, 2019 2:04:47 PM java.util.prefs.WindowsPreferences <init>
WARNING: Could not open/create prefs root node Software\JavaSoft\Prefs at root 0x80000002.
Windows RegCreateKeyEx(...) returned error code 5.
Creating summariser <summary>
Created the tree successfully using F:\jenkins\jenkins-slave\workspace\JMeter Windows\bin\testfiles\BUG_62847.jmx
Starting the test @ Thu Sep 19 14:04:47 PDT 2019 (1568927087447)
Waiting for possible Shutdown/StopTestNow/HeapDump/ThreadDump message on port 4445
summary =      6 in 00:00:00 =   12.8/s Avg:     0 Min:     0 Max:     2 Err:     0 (0.00%)
Tidying up ...    @ Thu Sep 19 14:04:48 PDT 2019 (1568927088106)
... end of run
No errors present in the logfile F:\jenkins\jenkins-slave\workspace\JMeter Windows\bin\BUG_62847.log
(the file is empty)

> Task :src:dist-check:batchBatchTestLocal
Sep 19, 2019 2:04:50 PM java.util.prefs.WindowsPreferences <init>
WARNING: Could not open/create prefs root node Software\JavaSoft\Prefs at root 0x80000002.
Windows RegCreateKeyEx(...) returned error code 5.
Creating summariser <summary>
Created the tree successfully using F:\jenkins\jenkins-slave\workspace\JMeter Windows\bin\testfiles\BatchTestLocal.jmx
Starting the test @ Thu Sep 19 14:04:50 PDT 2019 (1568927090660)
Waiting for possible Shutdown/StopTestNow/HeapDump/ThreadDump message on port 4445

> Task :src:protocol:http:check

> Task :src:dist-check:batchBatchTestLocal
summary +     55 in 00:00:40 =    1.4/s Avg:   124 Min:     0 Max:   253 Err:     8 (14.55%)
Active: 1 Started: 2 Finished: 1
summary +     78 in 00:00:11 =    6.9/s Avg:   141 Min:     1 Max:   253 Err:     8 (10.26%)
Active: 0 Started: 1 Finished: 1
summary =    133 in 00:00:52 =    2.6/s Avg:   134 Min:     0 Max:   253 Err:    16 (12.03%)
Tidying up ...    @ Thu Sep 19 14:05:42 PDT 2019 (1568927142737)
... end of run
ERROR: unexpected output for BatchTestLocal.csv:
  - expected 6677 bytes, F:\jenkins\jenkins-slave\workspace\JMeter Windows\bin\testfiles\BatchTestLocal.csv
  + actual 6677 bytes, F:\jenkins\jenkins-slave\workspace\JMeter Windows\bin\BatchTestLocal.csv
@@ -106,7 +106,7 @@
 Java If once 2,200,OK,text,true,,0,1,1,null,,1,0
 Java If all 1,,,text,false,,0,1,1,null,,1,1
 Java OK,200,OK,text,true,,0,1,1,null,,1,0
-"HTTP ""Request,",200,OK,text,true,,134731,1,1,file:testfiles/BatchTestLocal.jmx,,1,0
+"HTTP ""Request,",200,OK,text,true,,137066,1,1,file:testfiles/BatchTestLocal.jmx,,1,0
 1 1,200,OK,text,true,,0,1,1,null,,1,0
 2 2,200,OK,text,true,,0,1,1,null,,1,0
 3 3,200,OK,text,true,,0,1,1,null,,1,0
ERROR: unexpected output for BatchTestLocal.xml:
  - expected 46260 bytes, F:\jenkins\jenkins-slave\workspace\JMeter Windows\bin\testfiles\BatchTestLocal.xml
  + actual 45469 bytes, F:\jenkins\jenkins-slave\workspace\JMeter Windows\bin\BatchTestLocal.xml
@@ -653,7 +653,7 @@
   <responseData class="java.lang.String"></responseData>
   <responseFile class="java.lang.String"></responseFile>
 </sample>
-<httpSample s="true" lb="HTTP &quot;Request," rc="200" rm="OK" dt="text" by="134731"
sc="1" ec="0" ng="1" na="1">
+<httpSample s="true" lb="HTTP &quot;Request," rc="200" rm="OK" dt="text" by="137066"
sc="1" ec="0" ng="1" na="1">
   <responseHeader class="java.lang.String"></responseHeader>
   <requestHeader class="java.lang.String"></requestHeader>
   <responseFile class="java.lang.String"></responseFile>
No errors present in the logfile F:\jenkins\jenkins-slave\workspace\JMeter Windows\bin\BatchTestLocal.log
(the file is empty)

> Task :src:dist-check:batchBatchTestLocal FAILED
PGP key resolution time: 8412ms, resolution requests: 158, download time: 6511ms, keys downloaded:
77
PGP verification time: 4708ms, files processed: 158, processed: 110MiB, skipped: 1257MiB

FAILURE: Build failed with an exception.

* What went wrong:
Execution failed for task ':src:dist-check:batchBatchTestLocal'.
> Failures detected while testing F:\jenkins\jenkins-slave\workspace\JMeter Windows\bin\testfiles\BatchTestLocal.jmx:
[unexpected output BatchTestLocal.csv, unexpected output BatchTestLocal.xml]

* Try:
Run with --stacktrace option to get the stack trace. Run with --info or --debug option to
get more log output. Run with --scan to get full insights.

* Get more help at https://help.gradle.org

Deprecated Gradle features were used in this build, making it incompatible with Gradle 6.0.
Use '--warning-mode all' to show the individual deprecation warnings.
See https://docs.gradle.org/5.5.1/userguide/command_line_interface.html#sec:command_line_warnings

BUILD FAILED in 10m 46s
156 actionable tasks: 156 executed
Could not open/create prefs root node Software\JavaSoft\Prefs at root 0x80000002. Windows
RegCreateKeyEx(...) returned error code 5.
Build step 'Invoke Gradle script' changed build result to FAILURE
Build step 'Invoke Gradle script' marked build as failure

Mime
View raw message