jmeter-dev mailing list archives

Site index · List index
Message view « Date » · « Thread »
Top « Date » · « Thread »
From Apache Jenkins Server <jenk...@builds.apache.org>
Subject Build failed in Jenkins: JMeter-trunk #7384
Date Sat, 28 Sep 2019 14:29:00 GMT
See <https://builds.apache.org/job/JMeter-trunk/7384/display/redirect>

------------------------------------------
[...truncated 423.82 KB...]
    Thread[/0:0:0:0:0:0:0:1:57068 to /0:0:0:0:0:0:0:1:43874 workers Thread 2,5,main], stackTrace:sun.misc.Unsafe#park
    java.util.concurrent.locks.LockSupport#park at line:175
    java.util.concurrent.locks.AbstractQueuedSynchronizer$ConditionObject#await at line:2039
    org.gradle.internal.remote.internal.hub.queue.EndPointQueue#take at line:49
    org.gradle.internal.remote.internal.hub.MessageHub$ConnectionDispatch#run at line:320
    org.gradle.internal.concurrent.ExecutorPolicy$CatchAndRecordFailures#onExecute at line:64
    org.gradle.internal.concurrent.ManagedExecutorImpl$1#run at line:48
    java.util.concurrent.ThreadPoolExecutor#runWorker at line:1149
    java.util.concurrent.ThreadPoolExecutor$Worker#run at line:624
    org.gradle.internal.concurrent.ThreadFactoryImpl$ManagedThreadRunnable#run at line:56
    java.lang.Thread#run at line:748

    Thread[Test worker,5,main], stackTrace:java.lang.Thread#sleep
    org.apache.jmeter.samplers.TestSampleResult#testSubResults at line:215
    org.apache.jmeter.samplers.TestSampleResult#testSubResults at line:198
    org.apache.jmeter.samplers.TestSampleResult#testSubResultsTruePause at line:171
    sun.reflect.NativeMethodAccessorImpl#invoke0
    sun.reflect.NativeMethodAccessorImpl#invoke at line:62
    sun.reflect.DelegatingMethodAccessorImpl#invoke at line:43
    java.lang.reflect.Method#invoke at line:498
    org.junit.runners.model.FrameworkMethod$1#runReflectiveCall at line:50
    org.junit.internal.runners.model.ReflectiveCallable#run at line:12
    org.junit.runners.model.FrameworkMethod#invokeExplosively at line:47
    org.junit.internal.runners.statements.InvokeMethod#evaluate at line:17
    org.junit.runners.ParentRunner#runLeaf at line:325
    org.junit.runners.BlockJUnit4ClassRunner#runChild at line:78
    org.junit.runners.BlockJUnit4ClassRunner#runChild at line:57
    org.junit.runners.ParentRunner$3#run at line:290
    org.junit.runners.ParentRunner$1#schedule at line:71
    org.junit.runners.ParentRunner#runChildren at line:288
    org.junit.runners.ParentRunner#access$000 at line:58
    org.junit.runners.ParentRunner$2#evaluate at line:268
    org.junit.runners.ParentRunner#run at line:363
    org.junit.runner.JUnitCore#run at line:137
    org.junit.runner.JUnitCore#run at line:115
    org.junit.vintage.engine.execution.RunnerExecutor#execute at line:40
    org.junit.vintage.engine.VintageTestEngine$$Lambda$174/530737051#accept
    java.util.stream.ForEachOps$ForEachOp$OfRef#accept at line:184
    java.util.stream.ReferencePipeline$3$1#accept at line:193
    java.util.Iterator#forEachRemaining at line:116
    java.util.Spliterators$IteratorSpliterator#forEachRemaining at line:1801
    java.util.stream.AbstractPipeline#copyInto at line:481
    java.util.stream.AbstractPipeline#wrapAndCopyInto at line:471
    java.util.stream.ForEachOps$ForEachOp#evaluateSequential at line:151
    java.util.stream.ForEachOps$ForEachOp$OfRef#evaluateSequential at line:174
    java.util.stream.AbstractPipeline#evaluate at line:234
    java.util.stream.ReferencePipeline#forEach at line:418
    org.junit.vintage.engine.VintageTestEngine#executeAllChildren at line:80
    org.junit.vintage.engine.VintageTestEngine#execute at line:71
    org.junit.platform.launcher.core.DefaultLauncher#execute at line:220
    org.junit.platform.launcher.core.DefaultLauncher#lambda$execute$6 at line:188
    org.junit.platform.launcher.core.DefaultLauncher$$Lambda$119/1622551527#accept
    org.junit.platform.launcher.core.DefaultLauncher#withInterceptedStreams at line:202
    org.junit.platform.launcher.core.DefaultLauncher#execute at line:181
    org.junit.platform.launcher.core.DefaultLauncher#execute at line:128
    org.gradle.api.internal.tasks.testing.junitplatform.JUnitPlatformTestClassProcessor$CollectAllTestClassesExecutor#processAllTestClasses
at line:102
    org.gradle.api.internal.tasks.testing.junitplatform.JUnitPlatformTestClassProcessor$CollectAllTestClassesExecutor#access$000
at line:82
    org.gradle.api.internal.tasks.testing.junitplatform.JUnitPlatformTestClassProcessor#stop
at line:78
    org.gradle.api.internal.tasks.testing.SuiteTestClassProcessor#stop at line:61
    sun.reflect.NativeMethodAccessorImpl#invoke0
    sun.reflect.NativeMethodAccessorImpl#invoke at line:62
    sun.reflect.DelegatingMethodAccessorImpl#invoke at line:43
    java.lang.reflect.Method#invoke at line:498
    org.gradle.internal.dispatch.ReflectionDispatch#dispatch at line:36
    org.gradle.internal.dispatch.ReflectionDispatch#dispatch at line:24
    org.gradle.internal.dispatch.ContextClassLoaderDispatch#dispatch at line:33
    org.gradle.internal.dispatch.ProxyDispatchAdapter$DispatchingInvocationHandler#invoke
at line:94
    com.sun.proxy.$Proxy2#stop
    org.gradle.api.internal.tasks.testing.worker.TestWorker#stop at line:132
    sun.reflect.NativeMethodAccessorImpl#invoke0
    sun.reflect.NativeMethodAccessorImpl#invoke at line:62
    sun.reflect.DelegatingMethodAccessorImpl#invoke at line:43
    java.lang.reflect.Method#invoke at line:498
    org.gradle.internal.dispatch.ReflectionDispatch#dispatch at line:36
    org.gradle.internal.dispatch.ReflectionDispatch#dispatch at line:24
    org.gradle.internal.remote.internal.hub.MessageHubBackedObjectConnection$DispatchWrapper#dispatch
at line:182
    org.gradle.internal.remote.internal.hub.MessageHubBackedObjectConnection$DispatchWrapper#dispatch
at line:164
    org.gradle.internal.remote.internal.hub.MessageHub$Handler#run at line:412
    org.gradle.internal.concurrent.ExecutorPolicy$CatchAndRecordFailures#onExecute at line:64
    org.gradle.internal.concurrent.ManagedExecutorImpl$1#run at line:48
    java.util.concurrent.ThreadPoolExecutor#runWorker at line:1149
    java.util.concurrent.ThreadPoolExecutor$Worker#run at line:624
    org.gradle.internal.concurrent.ThreadFactoryImpl$ManagedThreadRunnable#run at line:56
    java.lang.Thread#run at line:748


org.apache.jmeter.engine.LocalHostTest > testLocalHost STANDARD_ERROR
    java.rmi.server.hostname=null
    asf935.gq1.ygridcore.net/67.195.81.176
    isSiteLocalAddress:false
    isAnyLocalAddress:false
    isLinkLocalAddress:false
    isLoopbackAddress:false
    isMulticastAddress:false
    localhost/127.0.0.1
    isSiteLocalAddress:false
    isAnyLocalAddress:false
    isLinkLocalAddress:false
    isLoopbackAddress:true
    isMulticastAddress:false
    ====================
    asf935.gq1.ygridcore.net/67.195.81.176
    isSiteLocalAddress:false
    isAnyLocalAddress:false
    isLinkLocalAddress:false
    isLoopbackAddress:false
    isMulticastAddress:false

org.apache.jmeter.engine.LocalHostTest > testInterfaces STANDARD_ERROR
    Interfaces: {name:veth6cbd8c3 (veth6cbd8c3) => [/fe80:0:0:0:a83f:90ff:fed1:e2cc%veth6cbd8c3/64
[null]], name:docker0 (docker0) => [/fe80:0:0:0:42:43ff:fef8:682a%docker0/64 [null], /172.17.0.1/16
[/172.17.255.255]], name:enp5s0f0 (enp5s0f0) => [/fe80:0:0:0:28c:faff:fe5b:3bc4%enp5s0f0/64
[null], /67.195.81.176/26 [/67.195.81.191]], name:lo (lo) => [/0:0:0:0:0:0:0:1%lo/128 [null],
/127.0.0.1/8 [null]]}
    Choose 172.17.0.1 to talk to external services
    java.rmi.server.hostname=null

Gradle Test Executor 3 finished executing tests.

> Task :src:core:test
Finished generating test XML results (0.011 secs) into: <https://builds.apache.org/job/JMeter-trunk/ws/src/core/build/test-results/test>
Generating HTML test report...
Finished generating test html results (0.027 secs) into: <https://builds.apache.org/job/JMeter-trunk/ws/src/core/build/reports/tests/test>
:src:core:test (Thread[Execution worker for ':' Thread 2,5,main]) completed. Took 5 mins 46.38
secs.
checksum-dependency elapsed time: 1642ms, configurations processed: 277 (add -PchecksumTimingsPrint
to print detailed timings)
Saving updated checksum.xml as <https://builds.apache.org/job/JMeter-trunk/ws/build/checksum/checksum.xml>
Closing Git repo: <https://builds.apache.org/job/JMeter-trunk/ws/.git>

FAILURE: Build failed with an exception.

* What went wrong:
Execution failed for task ':src:jorphan:test'.
> There were failing tests. See the report at: file://<https://builds.apache.org/job/JMeter-trunk/ws/src/jorphan/build/reports/tests/test/index.html>

* Try:
Run with --debug option to get more log output. Run with --scan to get full insights.

* Exception is:
org.gradle.api.tasks.TaskExecutionException: Execution failed for task ':src:jorphan:test'.
	at org.gradle.api.internal.tasks.execution.ExecuteActionsTaskExecuter$3.accept(ExecuteActionsTaskExecuter.java:166)
	at org.gradle.api.internal.tasks.execution.ExecuteActionsTaskExecuter$3.accept(ExecuteActionsTaskExecuter.java:163)
	at org.gradle.internal.Try$Failure.ifSuccessfulOrElse(Try.java:191)
	at org.gradle.api.internal.tasks.execution.ExecuteActionsTaskExecuter.execute(ExecuteActionsTaskExecuter.java:156)
	at org.gradle.api.internal.tasks.execution.ValidatingTaskExecuter.execute(ValidatingTaskExecuter.java:62)
	at org.gradle.api.internal.tasks.execution.SkipEmptySourceFilesTaskExecuter.execute(SkipEmptySourceFilesTaskExecuter.java:108)
	at org.gradle.api.internal.tasks.execution.ResolveBeforeExecutionOutputsTaskExecuter.execute(ResolveBeforeExecutionOutputsTaskExecuter.java:67)
	at org.gradle.api.internal.tasks.execution.ResolveAfterPreviousExecutionStateTaskExecuter.execute(ResolveAfterPreviousExecutionStateTaskExecuter.java:46)
	at org.gradle.api.internal.tasks.execution.CleanupStaleOutputsExecuter.execute(CleanupStaleOutputsExecuter.java:94)
	at org.gradle.api.internal.tasks.execution.FinalizePropertiesTaskExecuter.execute(FinalizePropertiesTaskExecuter.java:46)
	at org.gradle.api.internal.tasks.execution.ResolveTaskExecutionModeExecuter.execute(ResolveTaskExecutionModeExecuter.java:95)
	at org.gradle.api.internal.tasks.execution.SkipTaskWithNoActionsExecuter.execute(SkipTaskWithNoActionsExecuter.java:57)
	at org.gradle.api.internal.tasks.execution.SkipOnlyIfTaskExecuter.execute(SkipOnlyIfTaskExecuter.java:56)
	at org.gradle.api.internal.tasks.execution.CatchExceptionTaskExecuter.execute(CatchExceptionTaskExecuter.java:36)
	at org.gradle.api.internal.tasks.execution.EventFiringTaskExecuter$1.executeTask(EventFiringTaskExecuter.java:77)
	at org.gradle.api.internal.tasks.execution.EventFiringTaskExecuter$1.call(EventFiringTaskExecuter.java:55)
	at org.gradle.api.internal.tasks.execution.EventFiringTaskExecuter$1.call(EventFiringTaskExecuter.java:52)
	at org.gradle.internal.operations.DefaultBuildOperationExecutor$CallableBuildOperationWorker.execute(DefaultBuildOperationExecutor.java:416)
	at org.gradle.internal.operations.DefaultBuildOperationExecutor$CallableBuildOperationWorker.execute(DefaultBuildOperationExecutor.java:406)
	at org.gradle.internal.operations.DefaultBuildOperationExecutor$1.execute(DefaultBuildOperationExecutor.java:165)
	at org.gradle.internal.operations.DefaultBuildOperationExecutor.execute(DefaultBuildOperationExecutor.java:250)
	at org.gradle.internal.operations.DefaultBuildOperationExecutor.execute(DefaultBuildOperationExecutor.java:158)
	at org.gradle.internal.operations.DefaultBuildOperationExecutor.call(DefaultBuildOperationExecutor.java:102)
	at org.gradle.internal.operations.DelegatingBuildOperationExecutor.call(DelegatingBuildOperationExecutor.java:36)
	at org.gradle.api.internal.tasks.execution.EventFiringTaskExecuter.execute(EventFiringTaskExecuter.java:52)
	at org.gradle.execution.plan.LocalTaskNodeExecutor.execute(LocalTaskNodeExecutor.java:43)
	at org.gradle.execution.taskgraph.DefaultTaskExecutionGraph$InvokeNodeExecutorsAction.execute(DefaultTaskExecutionGraph.java:355)
	at org.gradle.execution.taskgraph.DefaultTaskExecutionGraph$InvokeNodeExecutorsAction.execute(DefaultTaskExecutionGraph.java:343)
	at org.gradle.execution.taskgraph.DefaultTaskExecutionGraph$BuildOperationAwareExecutionAction.execute(DefaultTaskExecutionGraph.java:336)
	at org.gradle.execution.taskgraph.DefaultTaskExecutionGraph$BuildOperationAwareExecutionAction.execute(DefaultTaskExecutionGraph.java:322)
	at org.gradle.execution.plan.DefaultPlanExecutor$ExecutorWorker$1.execute(DefaultPlanExecutor.java:134)
	at org.gradle.execution.plan.DefaultPlanExecutor$ExecutorWorker$1.execute(DefaultPlanExecutor.java:129)
	at org.gradle.execution.plan.DefaultPlanExecutor$ExecutorWorker.execute(DefaultPlanExecutor.java:202)
	at org.gradle.execution.plan.DefaultPlanExecutor$ExecutorWorker.executeNextNode(DefaultPlanExecutor.java:193)
	at org.gradle.execution.plan.DefaultPlanExecutor$ExecutorWorker.run(DefaultPlanExecutor.java:129)
	at org.gradle.internal.concurrent.ExecutorPolicy$CatchAndRecordFailures.onExecute(ExecutorPolicy.java:64)
	at org.gradle.internal.concurrent.ManagedExecutorImpl$1.run(ManagedExecutorImpl.java:48)
	at org.gradle.internal.concurrent.ThreadFactoryImpl$ManagedThreadRunnable.run(ThreadFactoryImpl.java:56)
Caused by: org.gradle.api.GradleException: There were failing tests. See the report at: file://<https://builds.apache.org/job/JMeter-trunk/ws/src/jorphan/build/reports/tests/test/index.html>
	at org.gradle.api.tasks.testing.AbstractTestTask.handleTestFailures(AbstractTestTask.java:632)
	at org.gradle.api.tasks.testing.AbstractTestTask.executeTests(AbstractTestTask.java:501)
	at org.gradle.api.tasks.testing.Test.executeTests(Test.java:613)
	at org.gradle.internal.reflect.JavaMethod.invoke(JavaMethod.java:103)
	at org.gradle.api.internal.project.taskfactory.StandardTaskAction.doExecute(StandardTaskAction.java:49)
	at org.gradle.api.internal.project.taskfactory.StandardTaskAction.execute(StandardTaskAction.java:42)
	at org.gradle.api.internal.project.taskfactory.StandardTaskAction.execute(StandardTaskAction.java:28)
	at org.gradle.api.internal.AbstractTask$TaskActionWrapper.execute(AbstractTask.java:717)
	at org.gradle.api.internal.AbstractTask$TaskActionWrapper.execute(AbstractTask.java:684)
	at org.gradle.api.internal.tasks.execution.ExecuteActionsTaskExecuter$5.run(ExecuteActionsTaskExecuter.java:476)
	at org.gradle.internal.operations.DefaultBuildOperationExecutor$RunnableBuildOperationWorker.execute(DefaultBuildOperationExecutor.java:402)
	at org.gradle.internal.operations.DefaultBuildOperationExecutor$RunnableBuildOperationWorker.execute(DefaultBuildOperationExecutor.java:394)
	at org.gradle.internal.operations.DefaultBuildOperationExecutor$1.execute(DefaultBuildOperationExecutor.java:165)
	at org.gradle.internal.operations.DefaultBuildOperationExecutor.execute(DefaultBuildOperationExecutor.java:250)
	at org.gradle.internal.operations.DefaultBuildOperationExecutor.execute(DefaultBuildOperationExecutor.java:158)
	at org.gradle.internal.operations.DefaultBuildOperationExecutor.run(DefaultBuildOperationExecutor.java:92)
	at org.gradle.internal.operations.DelegatingBuildOperationExecutor.run(DelegatingBuildOperationExecutor.java:31)
	at org.gradle.api.internal.tasks.execution.ExecuteActionsTaskExecuter.executeAction(ExecuteActionsTaskExecuter.java:461)
	at org.gradle.api.internal.tasks.execution.ExecuteActionsTaskExecuter.executeActions(ExecuteActionsTaskExecuter.java:444)
	at org.gradle.api.internal.tasks.execution.ExecuteActionsTaskExecuter.access$200(ExecuteActionsTaskExecuter.java:93)
	at org.gradle.api.internal.tasks.execution.ExecuteActionsTaskExecuter$TaskExecution.execute(ExecuteActionsTaskExecuter.java:237)
	at org.gradle.internal.execution.steps.ExecuteStep.lambda$execute$1(ExecuteStep.java:33)
	at org.gradle.internal.execution.steps.ExecuteStep.execute(ExecuteStep.java:33)
	at org.gradle.internal.execution.steps.ExecuteStep.execute(ExecuteStep.java:26)
	at org.gradle.internal.execution.steps.CleanupOutputsStep.execute(CleanupOutputsStep.java:58)
	at org.gradle.internal.execution.steps.CleanupOutputsStep.execute(CleanupOutputsStep.java:35)
	at org.gradle.internal.execution.steps.ResolveInputChangesStep.execute(ResolveInputChangesStep.java:48)
	at org.gradle.internal.execution.steps.ResolveInputChangesStep.execute(ResolveInputChangesStep.java:33)
	at org.gradle.internal.execution.steps.CancelExecutionStep.execute(CancelExecutionStep.java:39)
	at org.gradle.internal.execution.steps.TimeoutStep.executeWithoutTimeout(TimeoutStep.java:73)
	at org.gradle.internal.execution.steps.TimeoutStep.execute(TimeoutStep.java:54)
	at org.gradle.internal.execution.steps.CatchExceptionStep.execute(CatchExceptionStep.java:35)
	at org.gradle.internal.execution.steps.CreateOutputsStep.execute(CreateOutputsStep.java:51)
	at org.gradle.internal.execution.steps.SnapshotOutputsStep.execute(SnapshotOutputsStep.java:45)
	at org.gradle.internal.execution.steps.SnapshotOutputsStep.execute(SnapshotOutputsStep.java:31)
	at org.gradle.internal.execution.steps.CacheStep.executeWithoutCache(CacheStep.java:208)
	at org.gradle.internal.execution.steps.CacheStep.execute(CacheStep.java:70)
	at org.gradle.internal.execution.steps.CacheStep.execute(CacheStep.java:45)
	at org.gradle.internal.execution.steps.BroadcastChangingOutputsStep.execute(BroadcastChangingOutputsStep.java:49)
	at org.gradle.internal.execution.steps.StoreSnapshotsStep.execute(StoreSnapshotsStep.java:43)
	at org.gradle.internal.execution.steps.StoreSnapshotsStep.execute(StoreSnapshotsStep.java:32)
	at org.gradle.internal.execution.steps.RecordOutputsStep.execute(RecordOutputsStep.java:38)
	at org.gradle.internal.execution.steps.RecordOutputsStep.execute(RecordOutputsStep.java:24)
	at org.gradle.internal.execution.steps.SkipUpToDateStep.executeBecause(SkipUpToDateStep.java:96)
	at org.gradle.internal.execution.steps.SkipUpToDateStep.lambda$execute$0(SkipUpToDateStep.java:89)
	at org.gradle.internal.execution.steps.SkipUpToDateStep.execute(SkipUpToDateStep.java:54)
	at org.gradle.internal.execution.steps.SkipUpToDateStep.execute(SkipUpToDateStep.java:38)
	at org.gradle.internal.execution.steps.ResolveChangesStep.execute(ResolveChangesStep.java:76)
	at org.gradle.internal.execution.steps.ResolveChangesStep.execute(ResolveChangesStep.java:37)
	at org.gradle.internal.execution.steps.legacy.MarkSnapshottingInputsFinishedStep.execute(MarkSnapshottingInputsFinishedStep.java:36)
	at org.gradle.internal.execution.steps.legacy.MarkSnapshottingInputsFinishedStep.execute(MarkSnapshottingInputsFinishedStep.java:26)
	at org.gradle.internal.execution.steps.ResolveCachingStateStep.execute(ResolveCachingStateStep.java:90)
	at org.gradle.internal.execution.steps.ResolveCachingStateStep.execute(ResolveCachingStateStep.java:48)
	at org.gradle.internal.execution.steps.CaptureStateBeforeExecutionStep.execute(CaptureStateBeforeExecutionStep.java:69)
	at org.gradle.internal.execution.steps.CaptureStateBeforeExecutionStep.execute(CaptureStateBeforeExecutionStep.java:47)
	at org.gradle.internal.execution.impl.DefaultWorkExecutor.execute(DefaultWorkExecutor.java:33)
	at org.gradle.api.internal.tasks.execution.ExecuteActionsTaskExecuter.execute(ExecuteActionsTaskExecuter.java:140)
	... 34 more


* Get more help at https://help.gradle.org

Deprecated Gradle features were used in this build, making it incompatible with Gradle 6.0.
Use '--warning-mode all' to show the individual deprecation warnings.
See https://docs.gradle.org/5.6.1/userguide/command_line_interface.html#sec:command_line_warnings

BUILD FAILED in 6m 12s
153 actionable tasks: 34 executed, 119 up-to-date
Build step 'Invoke Gradle script' changed build result to FAILURE
Build step 'Invoke Gradle script' marked build as failure
[locks-and-latches] Releasing all the locks
[locks-and-latches] All the locks released
Archiving artifacts
[Fast Archiver] Compressed 176.76 MB of artifacts by 36.0% relative to #7348
Recording test results

Mime
View raw message