jmeter-dev mailing list archives

Site index · List index
Message view « Date » · « Thread »
Top « Date » · « Thread »
From Apache Jenkins Server <jenk...@builds.apache.org>
Subject Build failed in Jenkins: JMeter Windows #1475
Date Thu, 19 Sep 2019 21:13:10 GMT
See <https://builds.apache.org/job/JMeter%20Windows/1475/display/redirect>

------------------------------------------
[...truncated 59.03 KB...]
> Task :src:examples:spotbugsMain SKIPPED
> Task :src:dist:jar UP-TO-DATE
> Task :src:examples:spotbugsTest SKIPPED
> Task :src:dist-check:compileGroovy NO-SOURCE
> Task :src:generator:checkstyleMain UP-TO-DATE
> Task :src:dist:spotbugsMain SKIPPED
> Task :src:functions:checkstyleMain UP-TO-DATE
> Task :src:functions:spotbugsMain SKIPPED
> Task :src:release:spotbugsTest SKIPPED
> Task :src:dist-check:classes UP-TO-DATE
> Task :src:generator:compileTestJava NO-SOURCE
> Task :src:release:test NO-SOURCE
> Task :src:generator:testClasses UP-TO-DATE
> Task :src:release:check UP-TO-DATE
> Task :src:generator:checkstyleTest NO-SOURCE
> Task :src:generator:spotbugsMain SKIPPED
> Task :src:generator:spotbugsTest SKIPPED
> Task :src:dist-check:checkstyleMain NO-SOURCE
> Task :src:dist-check:spotbugsMain SKIPPED
> Task :src:generator:test NO-SOURCE
> Task :src:generator:check UP-TO-DATE
> Task :src:examples:test NO-SOURCE
> Task :src:examples:check UP-TO-DATE
> Task :src:protocol:java:checkstyleMain UP-TO-DATE
> Task :src:protocol:java:spotbugsMain SKIPPED
> Task :src:protocol:ftp:checkstyleMain UP-TO-DATE
> Task :src:protocol:ftp:spotbugsMain SKIPPED
> Task :src:protocol:jms:checkstyleMain UP-TO-DATE
> Task :src:protocol:jms:spotbugsMain SKIPPED
> Task :src:protocol:jdbc:checkstyleMain UP-TO-DATE
> Task :src:protocol:jdbc:spotbugsMain SKIPPED
> Task :src:protocol:http:checkstyleMain UP-TO-DATE
> Task :src:protocol:http:spotbugsMain SKIPPED
> Task :src:protocol:junit-sample:checkstyleMain UP-TO-DATE
> Task :src:protocol:junit-sample:spotbugsMain SKIPPED
> Task :src:protocol:junit:checkstyleMain UP-TO-DATE
> Task :src:protocol:junit:spotbugsMain SKIPPED
> Task :src:protocol:ldap:checkstyleMain UP-TO-DATE
> Task :src:protocol:ldap:spotbugsMain SKIPPED
> Task :src:dist:populateLibs
> Task :src:core:compileTestJava UP-TO-DATE
> Task :src:protocol:mail:checkstyleMain UP-TO-DATE
> Task :src:protocol:mail:spotbugsMain SKIPPED
> Task :src:protocol:native:checkstyleMain UP-TO-DATE
> Task :src:protocol:native:spotbugsMain SKIPPED
> Task :src:protocol:mongodb:checkstyleMain UP-TO-DATE
> Task :src:protocol:mongodb:spotbugsMain SKIPPED
> Task :src:core:compileTestGroovy UP-TO-DATE
> Task :src:protocol:tcp:checkstyleMain UP-TO-DATE
> Task :src:protocol:tcp:spotbugsMain SKIPPED
> Task :src:core:processTestResources UP-TO-DATE
> Task :src:core:testClasses UP-TO-DATE
> Task :src:core:testJar UP-TO-DATE
> Task :src:dist:copyBinLibs UP-TO-DATE
> Task :src:protocol:ftp:compileTestJava UP-TO-DATE
> Task :src:protocol:ftp:testClasses UP-TO-DATE
> Task :src:protocol:jdbc:compileTestJava UP-TO-DATE
> Task :src:protocol:java:compileTestJava UP-TO-DATE
> Task :src:protocol:java:testClasses UP-TO-DATE
> Task :src:protocol:ldap:compileTestJava UP-TO-DATE
> Task :src:protocol:ldap:testClasses UP-TO-DATE
> Task :src:protocol:jms:compileTestJava UP-TO-DATE
> Task :src:protocol:jms:testClasses UP-TO-DATE
> Task :src:protocol:junit:compileTestJava UP-TO-DATE
> Task :src:protocol:junit:testClasses UP-TO-DATE
> Task :src:protocol:ftp:testJar UP-TO-DATE
> Task :src:protocol:junit:testJar UP-TO-DATE
> Task :src:protocol:java:testJar UP-TO-DATE
> Task :src:protocol:jms:testJar UP-TO-DATE
> Task :src:protocol:ldap:testJar UP-TO-DATE
> Task :src:protocol:jdbc:compileTestGroovy UP-TO-DATE
> Task :src:protocol:jdbc:testClasses UP-TO-DATE
> Task :src:protocol:jdbc:testJar UP-TO-DATE
> Task :src:components:compileTestJava UP-TO-DATE
> Task :src:protocol:mail:compileTestJava UP-TO-DATE
> Task :src:protocol:mail:testClasses UP-TO-DATE
> Task :src:protocol:native:compileTestJava UP-TO-DATE
> Task :src:protocol:native:testClasses UP-TO-DATE
> Task :src:core:checkstyleMain UP-TO-DATE
> Task :src:protocol:ftp:checkstyleTest UP-TO-DATE
> Task :src:protocol:ftp:spotbugsTest SKIPPED
> Task :src:protocol:mail:testJar UP-TO-DATE
> Task :src:protocol:native:testJar UP-TO-DATE
> Task :src:components:compileTestGroovy UP-TO-DATE
> Task :src:components:testClasses UP-TO-DATE
> Task :src:dist:copyLibs UP-TO-DATE
> Task :src:dist:createDist UP-TO-DATE
> Task :src:core:checkstyleTest UP-TO-DATE
> Task :src:core:spotbugsMain SKIPPED
> Task :src:core:spotbugsTest SKIPPED
> Task :src:protocol:java:checkstyleTest UP-TO-DATE
> Task :src:protocol:jdbc:checkstyleTest UP-TO-DATE
> Task :src:protocol:java:spotbugsTest SKIPPED
> Task :src:protocol:jdbc:spotbugsTest SKIPPED
> Task :src:protocol:mongodb:compileTestJava UP-TO-DATE
> Task :src:protocol:mongodb:testClasses UP-TO-DATE
> Task :src:components:checkstyleTest UP-TO-DATE
> Task :src:components:spotbugsTest SKIPPED
> Task :src:protocol:tcp:compileTestJava UP-TO-DATE
> Task :src:protocol:tcp:testClasses UP-TO-DATE
> Task :src:protocol:mongodb:testJar UP-TO-DATE
> Task :src:dist-check:copyExtraTestLibs UP-TO-DATE
> Task :src:protocol:tcp:testJar UP-TO-DATE
> Task :src:protocol:ftp:test UP-TO-DATE
> Task :src:protocol:jdbc:test UP-TO-DATE
> Task :src:protocol:ftp:check UP-TO-DATE
> Task :src:protocol:jdbc:check UP-TO-DATE
> Task :src:protocol:java:test UP-TO-DATE
> Task :src:core:test UP-TO-DATE
> Task :src:core:check UP-TO-DATE
> Task :src:protocol:java:check UP-TO-DATE
> Task :src:protocol:junit-sample:compileTestJava NO-SOURCE
> Task :src:protocol:junit-sample:testClasses UP-TO-DATE
> Task :src:protocol:junit-sample:checkstyleTest NO-SOURCE
> Task :src:protocol:junit-sample:spotbugsTest SKIPPED
> Task :src:protocol:junit-sample:test NO-SOURCE
> Task :src:protocol:junit-sample:check UP-TO-DATE
> Task :src:protocol:mongodb:checkstyleTest UP-TO-DATE
> Task :src:protocol:mongodb:spotbugsTest SKIPPED
> Task :src:protocol:ldap:checkstyleTest UP-TO-DATE
> Task :src:protocol:ldap:spotbugsTest SKIPPED
> Task :src:protocol:mail:checkstyleTest UP-TO-DATE
> Task :src:protocol:junit:checkstyleTest UP-TO-DATE
> Task :src:protocol:mail:spotbugsTest SKIPPED
> Task :src:protocol:junit:spotbugsTest SKIPPED
> Task :src:protocol:jms:checkstyleTest UP-TO-DATE
> Task :src:protocol:jms:spotbugsTest SKIPPED
> Task :src:protocol:native:checkstyleTest UP-TO-DATE
> Task :src:protocol:native:spotbugsTest SKIPPED
> Task :src:protocol:mongodb:test UP-TO-DATE
> Task :src:protocol:mongodb:check UP-TO-DATE
> Task :src:protocol:jms:test UP-TO-DATE
> Task :src:protocol:jms:check UP-TO-DATE
> Task :src:protocol:ldap:test UP-TO-DATE
> Task :src:protocol:ldap:check UP-TO-DATE
> Task :src:protocol:mail:test UP-TO-DATE
> Task :src:protocol:tcp:checkstyleTest UP-TO-DATE
> Task :src:protocol:tcp:spotbugsTest SKIPPED
> Task :src:protocol:mail:check UP-TO-DATE
> Task :src:components:test UP-TO-DATE
> Task :src:components:check UP-TO-DATE
> Task :src:protocol:native:test UP-TO-DATE
> Task :src:protocol:native:check UP-TO-DATE
> Task :src:protocol:junit:test UP-TO-DATE
> Task :src:protocol:junit:check UP-TO-DATE
> Task :src:components:testJar UP-TO-DATE
> Task :src:protocol:tcp:test UP-TO-DATE
> Task :src:protocol:tcp:check UP-TO-DATE
> Task :src:functions:compileTestJava UP-TO-DATE
> Task :src:functions:compileTestGroovy UP-TO-DATE
> Task :src:functions:testClasses UP-TO-DATE
> Task :src:functions:testJar UP-TO-DATE
> Task :src:protocol:http:compileTestJava UP-TO-DATE
> Task :src:functions:checkstyleTest UP-TO-DATE
> Task :src:functions:spotbugsTest SKIPPED
> Task :src:protocol:http:compileTestGroovy UP-TO-DATE
> Task :src:protocol:http:testClasses UP-TO-DATE
> Task :src:protocol:http:testJar UP-TO-DATE
> Task :src:dist:compileTestJava NO-SOURCE
> Task :src:dist:testClasses UP-TO-DATE
> Task :src:dist:checkstyleTest NO-SOURCE
> Task :src:dist:spotbugsTest SKIPPED
> Task :src:dist:test NO-SOURCE
> Task :src:dist:check UP-TO-DATE
> Task :src:protocol:http:checkstyleTest UP-TO-DATE
> Task :src:protocol:http:spotbugsTest SKIPPED
> Task :src:functions:test UP-TO-DATE
> Task :src:functions:check UP-TO-DATE
> Task :src:protocol:http:test UP-TO-DATE
> Task :src:protocol:http:check UP-TO-DATE

> Task :src:dist-check:batchBUG_62847
Sep 19, 2019 2:12:14 PM java.util.prefs.WindowsPreferences <init>
WARNING: Could not open/create prefs root node Software\JavaSoft\Prefs at root 0x80000002.
Windows RegCreateKeyEx(...) returned error code 5.
Creating summariser <summary>
Created the tree successfully using F:\jenkins\jenkins-slave\workspace\JMeter Windows\bin\testfiles\BUG_62847.jmx
Starting the test @ Thu Sep 19 14:12:14 PDT 2019 (1568927534396)
Waiting for possible Shutdown/StopTestNow/HeapDump/ThreadDump message on port 4445
summary =      6 in 00:00:00 =   14.3/s Avg:     0 Min:     0 Max:     2 Err:     0 (0.00%)
Tidying up ...    @ Thu Sep 19 14:12:15 PDT 2019 (1568927535014)
... end of run
No errors present in the logfile F:\jenkins\jenkins-slave\workspace\JMeter Windows\bin\BUG_62847.log
(the file is empty)

> Task :src:dist-check:compileTestJava UP-TO-DATE
> Task :src:dist-check:compileTestGroovy UP-TO-DATE
> Task :src:dist-check:testClasses UP-TO-DATE
> Task :src:dist-check:checkstyleTest UP-TO-DATE
> Task :src:dist-check:spotbugsTest SKIPPED

> Task :src:dist-check:batchBatchTestLocal
Sep 19, 2019 2:12:17 PM java.util.prefs.WindowsPreferences <init>
WARNING: Could not open/create prefs root node Software\JavaSoft\Prefs at root 0x80000002.
Windows RegCreateKeyEx(...) returned error code 5.
Creating summariser <summary>
Created the tree successfully using F:\jenkins\jenkins-slave\workspace\JMeter Windows\bin\testfiles\BatchTestLocal.jmx
Starting the test @ Thu Sep 19 14:12:17 PDT 2019 (1568927537998)
Waiting for possible Shutdown/StopTestNow/HeapDump/ThreadDump message on port 4445
summary +     62 in 00:00:42 =    1.5/s Avg:   129 Min:     0 Max:   250 Err:     8 (12.90%)
Active: 1 Started: 2 Finished: 1
summary +     71 in 00:00:09 =    7.8/s Avg:   124 Min:     0 Max:   256 Err:     8 (11.27%)
Active: 0 Started: 1 Finished: 1
summary =    133 in 00:00:51 =    2.6/s Avg:   126 Min:     0 Max:   256 Err:    16 (12.03%)
Tidying up ...    @ Thu Sep 19 14:13:09 PDT 2019 (1568927589056)
... end of run
ERROR: unexpected output for BatchTestLocal.csv:
  - expected 6677 bytes, F:\jenkins\jenkins-slave\workspace\JMeter Windows\bin\testfiles\BatchTestLocal.csv
  + actual 6677 bytes, F:\jenkins\jenkins-slave\workspace\JMeter Windows\bin\BatchTestLocal.csv
@@ -106,7 +106,7 @@
 Java If once 2,200,OK,text,true,,0,1,1,null,,1,0
 Java If all 1,,,text,false,,0,1,1,null,,1,1
 Java OK,200,OK,text,true,,0,1,1,null,,1,0
-"HTTP ""Request,",200,OK,text,true,,134731,1,1,file:testfiles/BatchTestLocal.jmx,,1,0
+"HTTP ""Request,",200,OK,text,true,,137066,1,1,file:testfiles/BatchTestLocal.jmx,,1,0
 1 1,200,OK,text,true,,0,1,1,null,,1,0
 2 2,200,OK,text,true,,0,1,1,null,,1,0
 3 3,200,OK,text,true,,0,1,1,null,,1,0
ERROR: unexpected output for BatchTestLocal.xml:
  - expected 46260 bytes, F:\jenkins\jenkins-slave\workspace\JMeter Windows\bin\testfiles\BatchTestLocal.xml
  + actual 45469 bytes, F:\jenkins\jenkins-slave\workspace\JMeter Windows\bin\BatchTestLocal.xml
@@ -653,7 +653,7 @@
   <responseData class="java.lang.String"></responseData>
   <responseFile class="java.lang.String"></responseFile>
 </sample>
-<httpSample s="true" lb="HTTP &quot;Request," rc="200" rm="OK" dt="text" by="134731"
sc="1" ec="0" ng="1" na="1">
+<httpSample s="true" lb="HTTP &quot;Request," rc="200" rm="OK" dt="text" by="137066"
sc="1" ec="0" ng="1" na="1">
   <responseHeader class="java.lang.String"></responseHeader>
   <requestHeader class="java.lang.String"></requestHeader>
   <responseFile class="java.lang.String"></responseFile>
No errors present in the logfile F:\jenkins\jenkins-slave\workspace\JMeter Windows\bin\BatchTestLocal.log
(the file is empty)

> Task :src:dist-check:batchBatchTestLocal FAILED
PGP verification time: 1401ms, files processed: 150, processed: 104MiB, skipped: 1260MiB

FAILURE: Build failed with an exception.

* What went wrong:
Execution failed for task ':src:dist-check:batchBatchTestLocal'.
> Failures detected while testing F:\jenkins\jenkins-slave\workspace\JMeter Windows\bin\testfiles\BatchTestLocal.jmx:
[unexpected output BatchTestLocal.csv, unexpected output BatchTestLocal.xml]

* Try:
Run with --stacktrace option to get the stack trace. Run with --info or --debug option to
get more log output. Run with --scan to get full insights.

* Get more help at https://help.gradle.org

Deprecated Gradle features were used in this build, making it incompatible with Gradle 6.0.
Use '--warning-mode all' to show the individual deprecation warnings.
See https://docs.gradle.org/5.5.1/userguide/command_line_interface.html#sec:command_line_warnings

BUILD FAILED in 1m 18s
156 actionable tasks: 5 executed, 151 up-to-date
Build step 'Invoke Gradle script' changed build result to FAILURE
Build step 'Invoke Gradle script' marked build as failure

Mime
View raw message