jmeter-dev mailing list archives

Site index · List index
Message view « Date » · « Thread »
Top « Date » · « Thread »
From Apache Jenkins Server <jenk...@builds.apache.org>
Subject Build failed in Jenkins: JMeter-trunk #7353
Date Mon, 23 Sep 2019 19:51:08 GMT
See <https://builds.apache.org/job/JMeter-trunk/7353/display/redirect?page=changes>

Changes:

[pmouawad] Fix unparsed --request Fix unhandled --url

[pmouawad] fix space

------------------------------------------
[...truncated 140.87 KB...]
SpotBugs rule violations were found. See the report at: file://<https://builds.apache.org/job/JMeter-trunk/ws/src/dist-check/build/reports/spotbugs/test.xml>

> Task :src:dist-check:batchBatchTestLocal
Creating summariser <summary>
Created the tree successfully using <https://builds.apache.org/job/JMeter-trunk/ws/bin/testfiles/BatchTestLocal.jmx>
Starting the test @ Mon Sep 23 19:36:57 UTC 2019 (1569267417729)
Waiting for possible Shutdown/StopTestNow/HeapDump/ThreadDump message on port 4445
summary +     13 in 00:00:02 =    7.4/s Avg:   102 Min:     9 Max:   218 Err:     0 (0.00%)
Active: 1 Started: 1 Finished: 0

> Task :src:protocol:http:check

> Task :src:dist-check:batchBug50898
Creating summariser <summary>
Created the tree successfully using <https://builds.apache.org/job/JMeter-trunk/ws/bin/testfiles/Bug50898.jmx>
Starting the test @ Mon Sep 23 19:38:06 UTC 2019 (1569267486698)
Waiting for possible Shutdown/StopTestNow/HeapDump/ThreadDump message on port 4445
summary =      2 in 00:00:01 =    2.8/s Avg:   269 Min:   257 Max:   282 Err:     0 (0.00%)
Tidying up ...    @ Mon Sep 23 19:38:08 UTC 2019 (1569267488209)
... end of run
No errors present in the logfile <https://builds.apache.org/job/JMeter-trunk/ws/bin/Bug50898.log>
(the file is empty)

> Task :src:dist-check:batchBug52310
Creating summariser <summary>
Created the tree successfully using <https://builds.apache.org/job/JMeter-trunk/ws/bin/testfiles/Bug52310.jmx>
Starting the test @ Mon Sep 23 19:38:34 UTC 2019 (1569267514737)
Waiting for possible Shutdown/StopTestNow/HeapDump/ThreadDump message on port 4445
summary =      3 in 00:00:04 =    0.8/s Avg:  1041 Min:   955 Max:  1096 Err:     0 (0.00%)
Tidying up ...    @ Mon Sep 23 19:38:39 UTC 2019 (1569267519722)
... end of run
No errors present in the logfile <https://builds.apache.org/job/JMeter-trunk/ws/bin/Bug52310.log>
(the file is empty)

> Task :src:dist-check:batchBug52968
Creating summariser <summary>
Created the tree successfully using <https://builds.apache.org/job/JMeter-trunk/ws/bin/testfiles/Bug52968.jmx>
Starting the test @ Mon Sep 23 19:39:02 UTC 2019 (1569267542898)
Waiting for possible Shutdown/StopTestNow/HeapDump/ThreadDump message on port 4445
summary +      1 in 00:00:01 =    1.9/s Avg:   344 Min:   344 Max:   344 Err:     0 (0.00%)
Active: 1 Started: 1 Finished: 0
summary +     29 in 00:00:11 =    2.5/s Avg:   201 Min:   102 Max:   332 Err:     9 (31.03%)
Active: 0 Started: 10 Finished: 10
summary =     30 in 00:00:12 =    2.5/s Avg:   206 Min:   102 Max:   344 Err:     9 (30.00%)
Tidying up ...    @ Mon Sep 23 19:39:15 UTC 2019 (1569267555701)
... end of run
No errors present in the logfile <https://builds.apache.org/job/JMeter-trunk/ws/bin/Bug52968.log>
(the file is empty)

> Task :src:dist-check:batchBug54685
Creating summariser <summary>
Created the tree successfully using <https://builds.apache.org/job/JMeter-trunk/ws/bin/testfiles/Bug54685.jmx>
Starting the test @ Mon Sep 23 19:39:36 UTC 2019 (1569267576890)
Waiting for possible Shutdown/StopTestNow/HeapDump/ThreadDump message on port 4445
summary =      1 in 00:00:00 =    3.8/s Avg:   115 Min:   115 Max:   115 Err:     0 (0.00%)
Tidying up ...    @ Mon Sep 23 19:39:37 UTC 2019 (1569267577906)
... end of run
No errors present in the logfile <https://builds.apache.org/job/JMeter-trunk/ws/bin/Bug54685.log>
(the file is empty)

> Task :src:dist-check:batchBug55375
Creating summariser <summary>
Created the tree successfully using <https://builds.apache.org/job/JMeter-trunk/ws/bin/testfiles/Bug55375.jmx>
Starting the test @ Mon Sep 23 19:40:07 UTC 2019 (1569267607705)
Waiting for possible Shutdown/StopTestNow/HeapDump/ThreadDump message on port 4445
summary =      1 in 00:00:00 =    3.4/s Avg:   130 Min:   130 Max:   130 Err:     0 (0.00%)
Tidying up ...    @ Mon Sep 23 19:40:08 UTC 2019 (1569267608799)
... end of run
No errors present in the logfile <https://builds.apache.org/job/JMeter-trunk/ws/bin/Bug55375.log>
(the file is empty)

> Task :src:dist-check:batchBug56243
Creating summariser <summary>
Created the tree successfully using <https://builds.apache.org/job/JMeter-trunk/ws/bin/testfiles/Bug56243.jmx>
Starting the test @ Mon Sep 23 19:40:35 UTC 2019 (1569267635547)
Waiting for possible Shutdown/StopTestNow/HeapDump/ThreadDump message on port 4445
summary =      9 in 00:00:00 =   35.0/s Avg:     1 Min:     0 Max:    10 Err:     0 (0.00%)
Tidying up ...    @ Mon Sep 23 19:40:36 UTC 2019 (1569267636504)
... end of run
No errors present in the logfile <https://builds.apache.org/job/JMeter-trunk/ws/bin/Bug56243.log>
(the file is empty)

> Task :src:dist-check:batchBug56811
Creating summariser <summary>
Created the tree successfully using <https://builds.apache.org/job/JMeter-trunk/ws/bin/testfiles/Bug56811.jmx>
Starting the test @ Mon Sep 23 19:41:03 UTC 2019 (1569267663693)
Waiting for possible Shutdown/StopTestNow/HeapDump/ThreadDump message on port 4445
summary =      9 in 00:00:09 =    1.0/s Avg:   142 Min:     0 Max:   338 Err:     3 (33.33%)
Tidying up ...    @ Mon Sep 23 19:41:13 UTC 2019 (1569267673199)
... end of run
No errors present in the logfile <https://builds.apache.org/job/JMeter-trunk/ws/bin/Bug56811.log>
(the file is empty)

> Task :src:dist-check:batchBug60607
Creating summariser <summary>
Created the tree successfully using <https://builds.apache.org/job/JMeter-trunk/ws/bin/testfiles/Bug60607.jmx>
Starting the test @ Mon Sep 23 19:41:35 UTC 2019 (1569267695693)
Waiting for possible Shutdown/StopTestNow/HeapDump/ThreadDump message on port 4445
summary =      2 in 00:00:31 =    0.1/s Avg: 15283 Min:   459 Max: 30107 Err:     0 (0.00%)
Tidying up ...    @ Mon Sep 23 19:42:07 UTC 2019 (1569267727385)
... end of run
No errors present in the logfile <https://builds.apache.org/job/JMeter-trunk/ws/bin/Bug60607.log>
(the file is empty)

> Task :src:dist-check:batchBug62239
Creating summariser <summary>
Created the tree successfully using <https://builds.apache.org/job/JMeter-trunk/ws/bin/testfiles/Bug62239.jmx>
Starting the test @ Mon Sep 23 19:42:21 UTC 2019 (1569267741663)
Waiting for possible Shutdown/StopTestNow/HeapDump/ThreadDump message on port 4445
summary =    108 in 00:00:00 =  235.8/s Avg:     0 Min:     0 Max:     2 Err:     0 (0.00%)
Tidying up ...    @ Mon Sep 23 19:42:22 UTC 2019 (1569267742356)
... end of run
No errors present in the logfile <https://builds.apache.org/job/JMeter-trunk/ws/bin/Bug62239.log>
(the file is empty)

> Task :src:dist-check:batchFTP_TESTS
Creating summariser <summary>
Created the tree successfully using <https://builds.apache.org/job/JMeter-trunk/ws/bin/testfiles/FTP_TESTS.jmx>
Starting the test @ Mon Sep 23 19:43:12 UTC 2019 (1569267792721)
Waiting for possible Shutdown/StopTestNow/HeapDump/ThreadDump message on port 4445
summary =      6 in 00:00:03 =    2.3/s Avg:   226 Min:    15 Max:  1128 Err:     0 (0.00%)
Tidying up ...    @ Mon Sep 23 19:43:16 UTC 2019 (1569267796494)
... end of run
No errors present in the logfile <https://builds.apache.org/job/JMeter-trunk/ws/bin/FTP_TESTS.log>
(the file is empty)

> Task :src:dist-check:batchHTMLParserTestFile_2
Creating summariser <summary>
Created the tree successfully using <https://builds.apache.org/job/JMeter-trunk/ws/bin/testfiles/HTMLParserTestFile_2.jmx>
Starting the test @ Mon Sep 23 19:44:11 UTC 2019 (1569267851306)
Waiting for possible Shutdown/StopTestNow/HeapDump/ThreadDump message on port 4445
summary =      1 in 00:00:00 =    2.4/s Avg:   204 Min:   204 Max:   204 Err:     0 (0.00%)
Tidying up ...    @ Mon Sep 23 19:44:12 UTC 2019 (1569267852493)
... end of run
No errors present in the logfile <https://builds.apache.org/job/JMeter-trunk/ws/bin/HTMLParserTestFile_2.log>
(the file is empty)

> Task :src:dist-check:batchHttp4ImplDigestAuth
Creating summariser <summary>
Created the tree successfully using <https://builds.apache.org/job/JMeter-trunk/ws/bin/testfiles/Http4ImplDigestAuth.jmx>
Starting the test @ Mon Sep 23 19:45:10 UTC 2019 (1569267910211)
Waiting for possible Shutdown/StopTestNow/HeapDump/ThreadDump message on port 4445
summary =      2 in 00:00:02 =    0.8/s Avg:   738 Min:   221 Max:  1256 Err:     0 (0.00%)
Tidying up ...    @ Mon Sep 23 19:45:13 UTC 2019 (1569267913344)
... end of run
No errors present in the logfile <https://builds.apache.org/job/JMeter-trunk/ws/bin/Http4ImplDigestAuth.log>
(the file is empty)

> Task :src:dist-check:batchHttp4ImplPreemptiveBasicAuth
Creating summariser <summary>
Created the tree successfully using <https://builds.apache.org/job/JMeter-trunk/ws/bin/testfiles/Http4ImplPreemptiveBasicAuth.jmx>
Starting the test @ Mon Sep 23 19:46:01 UTC 2019 (1569267961251)
Waiting for possible Shutdown/StopTestNow/HeapDump/ThreadDump message on port 4445
summary +      1 in 00:00:02 =    0.7/s Avg:   270 Min:   270 Max:   270 Err:     0 (0.00%)
Active: 1 Started: 1 Finished: 0
summary +     11 in 00:00:05 =    2.1/s Avg:   270 Min:   137 Max:   792 Err:     0 (0.00%)
Active: 0 Started: 6 Finished: 6
summary =     12 in 00:00:07 =    1.8/s Avg:   270 Min:   137 Max:   792 Err:     0 (0.00%)
Tidying up ...    @ Mon Sep 23 19:46:09 UTC 2019 (1569267969141)
... end of run
No errors present in the logfile <https://builds.apache.org/job/JMeter-trunk/ws/bin/Http4ImplPreemptiveBasicAuth.log>
(the file is empty)

> Task :src:dist-check:batchHttp4ImplPreemptiveBasicAuthJava
Creating summariser <summary>
Created the tree successfully using <https://builds.apache.org/job/JMeter-trunk/ws/bin/testfiles/Http4ImplPreemptiveBasicAuth.jmx>
Starting the test @ Mon Sep 23 19:47:32 UTC 2019 (1569268052938)
Waiting for possible Shutdown/StopTestNow/HeapDump/ThreadDump message on port 4445
summary +      1 in 00:00:01 =    0.7/s Avg:   388 Min:   388 Max:   388 Err:     0 (0.00%)
Active: 1 Started: 1 Finished: 0
summary +     11 in 00:00:05 =    2.1/s Avg:   267 Min:   169 Max:  1229 Err:     0 (0.00%)
Active: 0 Started: 6 Finished: 6
summary =     12 in 00:00:07 =    1.8/s Avg:   277 Min:   169 Max:  1229 Err:     0 (0.00%)
Tidying up ...    @ Mon Sep 23 19:47:40 UTC 2019 (1569268060727)
... end of run
No errors present in the logfile <https://builds.apache.org/job/JMeter-trunk/ws/bin/Http4ImplPreemptiveBasicAuth.log>
(the file is empty)

> Task :src:dist-check:batchJDBC_TESTS
Creating summariser <summary>
Created the tree successfully using <https://builds.apache.org/job/JMeter-trunk/ws/bin/testfiles/JDBC_TESTS.jmx>
Starting the test @ Mon Sep 23 19:48:19 UTC 2019 (1569268099545)
Waiting for possible Shutdown/StopTestNow/HeapDump/ThreadDump message on port 4445
summary =     27 in 00:00:01 =   20.4/s Avg:    18 Min:     0 Max:   434 Err:     0 (0.00%)
Tidying up ...    @ Mon Sep 23 19:48:24 UTC 2019 (1569268104020)
... end of run
WARNING: the task was configured to ignore errors in the output log
Logfile contents (errors during the test, see <https://builds.apache.org/job/JMeter-trunk/ws/bin/JDBC_TESTS.log)>:
2019-09-23 19:48:23,996 ERROR o.a.j.t.JMeterThread: Error while processing sampler: 'JDBC_With_Failing_PreProcessor'.
java.lang.IllegalArgumentException: Variable Name must not be null in JDBC PreProcessor
	at org.apache.jmeter.protocol.jdbc.processor.AbstractJDBCProcessor.process(AbstractJDBCProcessor.java:45)
~[ApacheJMeter_jdbc.jar:5.2.0-SNAPSHOT]
	at org.apache.jmeter.protocol.jdbc.processor.JDBCPreProcessor.process(JDBCPreProcessor.java:33)
~[ApacheJMeter_jdbc.jar:5.2.0-SNAPSHOT]
	at org.apache.jmeter.threads.JMeterThread.runPreProcessors(JMeterThread.java:941) ~[ApacheJMeter_core.jar:5.2.0-SNAPSHOT]
	at org.apache.jmeter.threads.JMeterThread.executeSamplePackage(JMeterThread.java:542) ~[ApacheJMeter_core.jar:5.2.0-SNAPSHOT]
	at org.apache.jmeter.threads.JMeterThread.processSampler(JMeterThread.java:490) [ApacheJMeter_core.jar:5.2.0-SNAPSHOT]
	at org.apache.jmeter.threads.JMeterThread.run(JMeterThread.java:257) [ApacheJMeter_core.jar:5.2.0-SNAPSHOT]
	at java.lang.Thread.run(Thread.java:748) [?:1.8.0_191]
2019-09-23 19:48:24,005 ERROR o.a.j.t.JMeterThread: Error while processing sampler: 'JDBC_With_Failing_PostProcessor'.
java.lang.IllegalArgumentException: Variable Name must not be null in JDBC PostProcessor
	at org.apache.jmeter.protocol.jdbc.processor.AbstractJDBCProcessor.process(AbstractJDBCProcessor.java:45)
~[ApacheJMeter_jdbc.jar:5.2.0-SNAPSHOT]
	at org.apache.jmeter.protocol.jdbc.processor.JDBCPostProcessor.process(JDBCPostProcessor.java:33)
~[ApacheJMeter_jdbc.jar:5.2.0-SNAPSHOT]
	at org.apache.jmeter.threads.JMeterThread.runPostProcessors(JMeterThread.java:931) ~[ApacheJMeter_core.jar:5.2.0-SNAPSHOT]
	at org.apache.jmeter.threads.JMeterThread.executeSamplePackage(JMeterThread.java:569) ~[ApacheJMeter_core.jar:5.2.0-SNAPSHOT]
	at org.apache.jmeter.threads.JMeterThread.processSampler(JMeterThread.java:490) [ApacheJMeter_core.jar:5.2.0-SNAPSHOT]
	at org.apache.jmeter.threads.JMeterThread.run(JMeterThread.java:257) [ApacheJMeter_core.jar:5.2.0-SNAPSHOT]
	at java.lang.Thread.run(Thread.java:748) [?:1.8.0_191]
2019-09-23 19:48:24,006 WARN o.a.j.p.j.p.AbstractJDBCProcessor: SQL Problem in JDBC PreProcessor:
java.sql.SQLSyntaxErrorException: unexpected token: USERS
2019-09-23 19:48:24,015 WARN o.a.j.p.j.p.AbstractJDBCProcessor: SQL Problem in JDBC PostProcessor:
java.sql.SQLSyntaxErrorException: unexpected token: USERS

> Task :src:dist-check:batchJMS_TESTS
Creating summariser <summary>
Created the tree successfully using <https://builds.apache.org/job/JMeter-trunk/ws/bin/testfiles/JMS_TESTS.jmx>
Starting the test @ Mon Sep 23 19:49:01 UTC 2019 (1569268141404)
Waiting for possible Shutdown/StopTestNow/HeapDump/ThreadDump message on port 4445
summary +     24 in 00:00:31 =    0.8/s Avg:   670 Min:     0 Max:  5441 Err:     0 (0.00%)
Active: 1 Started: 5 Finished: 4
summary +      3 in 00:00:03 =    1.0/s Avg:  1023 Min:     0 Max:  3001 Err:     0 (0.00%)
Active: 0 Started: 1 Finished: 1
summary =     27 in 00:00:34 =    0.8/s Avg:   709 Min:     0 Max:  5441 Err:     0 (0.00%)
Tidying up ...    @ Mon Sep 23 19:49:36 UTC 2019 (1569268176628)
... end of run
No errors present in the logfile <https://builds.apache.org/job/JMeter-trunk/ws/bin/JMS_TESTS.log>
(the file is empty)

> Task :src:dist-check:batchOS_TESTS
Creating summariser <summary>
Created the tree successfully using <https://builds.apache.org/job/JMeter-trunk/ws/bin/testfiles/OS_TESTS.jmx>
Starting the test @ Mon Sep 23 19:49:56 UTC 2019 (1569268196311)
Waiting for possible Shutdown/StopTestNow/HeapDump/ThreadDump message on port 4445
summary =      3 in 00:00:02 =    1.5/s Avg:   345 Min:    12 Max:  1004 Err:     0 (0.00%)
Tidying up ...    @ Mon Sep 23 19:49:58 UTC 2019 (1569268198627)
... end of run
No errors present in the logfile <https://builds.apache.org/job/JMeter-trunk/ws/bin/OS_TESTS.log>
(the file is empty)

> Task :src:dist-check:batchResponseDecompression
Creating summariser <summary>
Created the tree successfully using <https://builds.apache.org/job/JMeter-trunk/ws/bin/testfiles/ResponseDecompression.jmx>
Starting the test @ Mon Sep 23 19:50:26 UTC 2019 (1569268226546)
Waiting for possible Shutdown/StopTestNow/HeapDump/ThreadDump message on port 4445
summary +      3 in 00:00:05 =    0.6/s Avg:  1425 Min:   107 Max:  3433 Err:     0 (0.00%)
Active: 1 Started: 1 Finished: 0
summary +      3 in 00:00:02 =    1.4/s Avg:   301 Min:   227 Max:   351 Err:     0 (0.00%)
Active: 0 Started: 1 Finished: 1
summary =      6 in 00:00:07 =    0.8/s Avg:   863 Min:   107 Max:  3433 Err:     0 (0.00%)
Tidying up ...    @ Mon Sep 23 19:50:34 UTC 2019 (1569268234636)
... end of run
No errors present in the logfile <https://builds.apache.org/job/JMeter-trunk/ws/bin/ResponseDecompression.log>
(the file is empty)

> Task :src:dist-check:batchServerBatchTestLocal FAILED
checksum-dependency elapsed time: 15593ms, configurations processed: 498 (add -PchecksumTimingsPrint
to print detailed timings)

FAILURE: Build failed with an exception.

* What went wrong:
Execution failed for task ':src:dist-check:batchServerBatchTestLocal'.
> Unable to connect to asf935.gq1.ygridcore.net:44141 with timeout of PT5S

* Try:
Run with --stacktrace option to get the stack trace. Run with --info or --debug option to
get more log output. Run with --scan to get full insights.

* Get more help at https://help.gradle.org

Deprecated Gradle features were used in this build, making it incompatible with Gradle 6.0.
Use '--warning-mode all' to show the individual deprecation warnings.
See https://docs.gradle.org/5.5.1/userguide/command_line_interface.html#sec:command_line_warnings

BUILD FAILED in 28m 34s
263 actionable tasks: 143 executed, 120 up-to-date
Build step 'Invoke Gradle script' changed build result to FAILURE
Build step 'Invoke Gradle script' marked build as failure
[locks-and-latches] Releasing all the locks
[locks-and-latches] All the locks released
Archiving artifacts
[Fast Archiver] Compressed 176.65 MB of artifacts by 63.4% relative to #7348
Recording test results

Mime
View raw message